program: Gaussian 09
title: 000192885
version: EM64L-G09RevD.01
frameworkgroup: C1[X(C28H16)]
method: RPBEPBE
basis: SDD
operation: Freq
keyword: #p
keyword: freq=noraman
keyword: PBEPBE/SDD
title: #p freq=noraman PBEPBE/SDD
converged: YES YES NO NO
title: Mulliken charges:
elementType: C C C C C C C C C C C C C C C C C C C C C C C C C C C C H H H H H H H H H H H H H H H H
charge: -0.179330 -0.158581 -0.680534 0.402699 0.369225 0.423872 0.421553 0.398850 0.228970 0.216289 -0.748974 0.256292 0.557616 -0.389596 -0.434313 -0.427115 -0.433562 -0.260519 -0.383651 -0.382218 -0.381558 -0.500373 -0.284042 -0.276941 -0.280319 -0.281004 -0.254715 -0.250218 0.236074 0.231801 0.228434 0.235274 0.233975 0.222857 0.230149 0.230550 0.231653 0.248878 0.229655 0.230191 0.230179 0.230408 0.230403 0.231718
chargesum: 0.00000
title: Mulliken charges with hydrogens summed into heavy atoms:
elementType: C C C C C C C C C C C C C C C C C C C C C C C C C C C C
charge: -0.179330 -0.158581 -0.680534 0.402699 0.369225 0.423872 0.421553 0.398850 0.228970 0.216289 -0.512899 0.256292 0.557616 -0.157795 -0.205879 -0.191842 -0.199587 -0.037662 -0.153502 -0.151668 -0.149906 -0.251496 -0.054386 -0.046750 -0.050140 -0.050596 -0.024312 -0.018500
polarizability: 5.47952626e+02 2.60008176e+01 4.14344718e+02 1.93466986e-03 -2.63657549e-03 1.09153501e+02
1716.lowfreq: -0.0012 0.0007 0.0011 2.9453 6.7138 10.4695 26.1335 51.6403 74.4024
frequency: 26.0831 51.6205 74.3848 100.7409 112.9103 121.6306 123.1592 197.7059 218.1957 236.0743 243.7550 260.3404 290.5009 291.2582 307.2499 371.2100 401.1967 416.7497 421.0822 431.0899 453.9056 465.2762 481.0903 489.8114 516.0231 551.9578 571.9595 572.2100 577.0129 610.4505 611.6679 615.0082 645.7224 649.3854 650.8951 706.2384 730.4428 731.5493 734.1332 762.4871 771.2768 774.5149 779.8732 790.4195 802.4087 803.7120 843.1991 863.3420 869.0853 877.9322 882.0042 887.9126 907.4428 949.0270 952.1896 954.5483 959.3500 971.8462 980.3952 984.6711 990.8805 991.5651 993.3329 1034.8941 1037.0319 1044.9592 1051.7592 1071.4176 1072.1136 1085.8943 1111.1403 1130.4938 1158.1581 1175.4341 1177.0927 1180.0796 1185.2566 1212.4013 1220.9273 1236.5202 1253.0292 1271.5747 1292.9439 1295.6715 1302.1082 1329.2884 1350.8703 1372.7692 1388.5012 1399.3069 1404.3910 1416.5553 1420.4770 1437.3746 1442.4837 1447.7427 1460.3631 1477.7909 1481.5983 1511.5489 1515.4086 1534.9567 1565.3404 1574.7429 1602.8300 1603.8612 1615.1163 1618.5468 1621.6026 1628.4982 3119.7728 3128.5676 3129.7388 3130.6505 3133.3782 3143.4313 3146.1935 3149.3203 3151.6565 3155.1688 3161.1664 3164.3383 3169.6193 3174.3284 3206.0113 3210.2973
redmass: 5.2645 4.4592 4.0128 3.7900 4.2142 5.5343 4.4860 4.3237 5.7002 3.9501 5.2189 4.6558 3.7249 5.5370 5.8178 4.7288 6.6979 3.3195 6.1053 3.1472 3.4187 5.9878 6.3696 3.0674 3.3160 3.5785 2.9784 6.3569 7.3456 7.0464 3.4194 6.9600 6.8220 3.1756 6.6134 5.7975 1.6872 6.4424 1.7347 1.3074 1.5250 2.2707 6.0487 1.8421 2.0224 6.0644 1.7298 1.5653 6.1982 1.5835 5.2947 2.2150 1.5819 1.5671 7.3677 1.5485 1.5313 1.8115 1.5637 1.3552 1.3427 7.3780 1.4482 2.6798 3.3862 2.3392 2.3601 8.2276 3.1855 2.2442 2.5172 1.9319 1.3900 1.1259 1.1120 1.1382 1.4440 1.4599 1.5458 2.3695 1.6146 2.0422 2.1198 1.9720 2.5680 2.4649 2.6063 3.9636 4.5083 4.6429 4.3496 3.5780 2.9493 2.9871 2.8125 2.7101 3.0295 3.3898 3.8154 4.4444 3.5152 4.8743 6.7095 7.5206 7.1596 7.1375 6.6503 6.0074 6.8308 7.1671 1.0871 1.0854 1.0868 1.0861 1.0871 1.0914 1.0941 1.0916 1.0918 1.0936 1.0989 1.1000 1.0944 1.0956 1.0910 1.0907
irintensity: 0.0181 0.4817 0.5220 0.1814 2.4981 0.2124 0.0378 0.0140 0.1093 1.1171 0.3373 0.3451 1.0730 0.3460 0.3426 0.0216 0.9283 1.1314 0.5260 8.8359 0.2782 0.2151 0.2539 2.9598 3.7843 4.1265 0.0053 13.0784 3.0416 11.3628 1.2722 2.4431 2.4620 2.5041 0.0876 0.0834 9.7032 0.0044 89.5017 90.9564 23.7842 19.6302 0.0673 75.2709 3.0378 0.0684 7.0009 2.8985 1.2516 3.0607 0.4514 3.6088 1.3771 0.9298 1.5521 0.0082 0.4698 12.7092 9.2571 0.1619 0.0023 1.7405 2.0631 9.4373 4.4352 5.8298 11.7715 0.4490 0.7814 5.9271 0.2414 1.6712 2.2724 1.5180 1.4946 1.4149 7.2189 4.0251 8.4799 11.9276 10.2722 3.3405 8.8139 2.3324 4.8481 1.5560 4.1899 4.0506 0.5826 0.6220 1.7520 27.8658 5.2584 30.9835 13.1504 1.6601 2.0821 17.9848 50.5917 6.4293 0.3953 20.1574 8.2284 1.3219 5.8150 13.5453 3.4676 0.6790 2.1345 0.0898 3.1147 0.1883 2.2578 1.6501 8.3937 30.1850 10.4338 11.1794 6.0483 28.5291 25.2188 54.8090 64.3541 12.9885 16.2591 15.6575
temp: 298.150 k
press: 1.00000 atm
elementType: 6 6 6 6 6 6 6 6 6 6 6 6 6 6 6 6 6 6 6 6 6 6 6 6 6 6 6 6 1 1 1 1 1 1 1 1 1 1 1 1 1 1 1 1
symmnumber: 1
zpe: 901395.7 jmol-1
zpe.correction: 0.343324 hartree
zpe.thermalcorrener: 0.362025 hartree
zpe.thermalcorrenthalpy: 0.362969 hartree
zpe.thermalcorrgfe: 0.296716 hartree
zpe.sumelectzpe: -1074.841538 hartree
zpe.sumelectthermal: -1074.822837 hartree
zpe.sumelectthermalent: -1074.821893 hartree
zpe.sumelectthermalfe: -1074.888146 hartree
dipole: 0.6081 0.0543 0.0005
dipole: 0.6105
quadrupole: -131.2173 -134.2981 -172.6853
quadrupole: 0.3484 0.0007 -0.0005
quadrupole: 14.8496 11.7688 -26.6184 0.3484 0.0007 -0.0005
hfenergy: -1075.1848619 hartree
pointgroup: C01 [X(C28H16)]
dipole: -0.2392694 0.0211243 -0.0000147 debye
polarizability: 547.9999079|-25.8791399|414.2938559|-0.365914|-0.9757363|109.1570825 unknown
InChI: InChI=1S/C28H16/c1-2-9-18-17(8-1)16-25-26-21(18)14-7-15-24(26)27-22-12-5-3-10-19(22)20-11-4-6-13-23(20)28(25)27/h1-16H
charge 0 multiplicity 1
44 atoms
C  0.607172 0.507306 -0.005141
C  1.04128 -0.845212 -0.001186
C  -1.296128 -0.864457 0.0013
C  -0.87861 0.522631 -0.003637
C  -0.156581 -1.730208 0.003027
C  1.557937 1.598183 -0.009786
C  -2.6373 -1.302898 0.004001
C  2.44918 -1.177297 -0.001741
C  2.971867 1.29198 -0.010454
C  3.420613 -0.104925 -0.006401
C  -1.874092 1.492809 -0.005759
C  -3.681023 -0.277419 0.001537
C  -3.275062 1.112575 -0.003249
C  -0.39539 -3.11705 0.007946
C  -2.846596 -2.718953 0.00893
C  1.154316 2.971817 -0.013794
C  2.920244 -2.529538 0.00211
C  -1.744007 -3.590217 0.010851
C  3.901524 2.376891 -0.015123
C  4.808007 -0.446336 -0.006938
C  -5.072764 -0.582327 0.003549
C  -4.281147 2.128951 -0.005652
C  2.088914 4.011628 -0.018333
C  4.285499 -2.831135 0.001468
C  3.479272 3.711443 -0.019019
C  5.240884 -1.777623 -0.003106
C  -6.0402 0.434111 0.001047
C  -5.642656 1.801436 -0.003563
H  -1.662935 2.565712 -0.009418
H  0.404938 -3.860027 0.009728
H  -3.858737 -3.136149 0.011257
H  0.093646 3.221494 -0.013327
H  2.203201 -3.349696 0.005623
H  -1.917423 -4.672127 0.014702
H  4.97576 2.173502 -0.015715
H  5.563744 0.343755 -0.010427
H  -5.397446 -1.628052 0.007077
H  -3.968651 3.180155 -0.009253
H  1.751827 5.053932 -0.021362
H  4.618293 -3.874771 0.004478
H  4.216804 4.521283 -0.02258
H  6.312087 -2.006633 -0.003627
H  -7.105025 0.176626 0.002645
H  -6.40133 2.59133 -0.005482
