program: Gaussian 09
title: 000192990
version: EM64L-G09RevD.01
frameworkgroup: C1[X(C21H30O5)]
method: RPBEPBE
basis: SDD
operation: Freq
keyword: #pfreq=noraman
keyword: PBEPBE/SDD
title: #p freq=noraman PBEPBE/SDD
converged: NO YES NO NO
title: Mulliken charges:
elementType: O O O O O C C C C C C C C C C C C C C C C C C C C C H H H H H H H H H H H H H H H H H H H H H H H H H H H H H H
charge: -0.489882 -0.435548 -0.232864 -0.443155 -0.231654 0.283006 -0.088314 -0.160608 -0.100769 0.093780 -0.510523 0.230251 -0.592112 -0.535728 -0.155352 -0.480455 -0.807663 0.538758 -0.641520 -0.492850 -0.809178 0.063114 -0.563054 -0.583434 0.178001 -0.370566 0.224348 0.234192 0.204149 0.164596 0.233300 0.241418 0.244092 0.230019 0.234364 0.285044 0.233110 0.218687 0.248834 0.238886 0.227063 0.224357 0.239109 0.217761 0.214659 0.238400 0.221949 0.227103 0.344814 0.247406 0.232989 0.257324 0.364032 0.219472 0.258402 0.368440
chargesum: 0.00000
title: Mulliken charges with hydrogens summed into heavy atoms:
elementType: O O O O O C C C C C C C C C C C C C C C C C C C C C
charge: -0.145068 -0.071515 -0.232864 -0.074715 -0.231654 0.283006 0.136034 0.073584 0.103381 0.093780 -0.112627 0.230251 -0.106603 -0.071346 0.129692 -0.028658 -0.092880 0.538758 -0.178054 -0.060430 -0.121726 0.063114 -0.082660 -0.326110 0.178001 0.107309
polarizability: 3.06687628e+02 -6.09246708e-01 2.12778167e+02 -1.74689141e+01 3.83978485e+00 1.89284482e+02
1716.lowfreq: -15.6144 -6.3155 -0.0005 -0.0003 0.0004 4.8431 21.8946 29.1936 36.8120
frequency: 21.5867 28.8806 36.5390 55.6417 72.4605 94.7515 120.0567 131.5659 143.9314 150.6350 158.1449 169.7210 185.8735 190.4690 207.4638 216.2544 222.4735 237.9157 263.6699 275.3102 276.6139 299.0159 315.8030 319.6378 326.5910 338.5595 360.1708 375.9325 389.2603 395.5803 405.5801 416.2401 438.7635 451.8534 462.9516 485.6006 489.6839 500.9128 509.8233 524.2022 527.5766 531.6363 559.2792 604.7897 639.0685 649.0195 673.8952 712.1458 741.1200 753.1028 776.7303 785.2357 807.8055 831.6791 837.3838 857.6553 871.5842 883.9839 899.4493 910.9134 918.3697 930.0043 940.3234 954.3853 967.0388 974.9686 993.0908 996.9606 1009.4855 1014.8987 1027.2908 1029.6959 1039.0868 1052.6007 1056.3320 1072.0306 1081.9171 1110.5553 1113.7740 1116.3303 1124.3611 1126.8983 1144.3986 1155.8583 1167.4005 1171.9818 1176.3744 1186.4840 1188.5800 1195.9139 1202.1657 1222.8854 1228.9348 1237.1544 1240.5562 1254.3238 1256.0229 1269.1162 1277.9679 1278.9208 1287.9799 1301.4447 1305.6469 1320.0356 1323.4019 1328.5096 1331.4339 1338.3105 1342.7914 1345.8325 1351.0436 1355.4922 1361.6705 1380.4127 1385.6520 1392.6591 1410.8476 1431.3282 1443.0080 1450.3101 1455.1752 1462.4698 1467.5987 1469.2791 1472.0041 1478.9948 1482.6022 1485.2039 1495.4662 1586.1608 1596.2490 1625.5571 2913.2220 2915.4574 2933.5000 2951.6691 2963.7956 2965.5324 2973.4492 2975.0988 2980.8789 2986.2234 2999.1915 2999.8637 3002.4508 3009.8896 3017.8078 3038.0702 3041.5426 3042.8348 3057.0486 3063.0118 3068.0317 3078.1783 3079.7401 3081.7134 3097.0482 3111.3152 3119.3050 3426.1773 3480.5958 3566.8117
redmass: 5.7544 6.5051 5.0472 4.2591 3.6407 4.3944 3.5733 2.6266 1.7470 1.8954 2.0799 1.6329 3.5908 2.9568 1.8412 2.8352 2.4706 3.0044 2.7373 2.4662 2.4587 2.9792 4.0227 3.0540 3.7293 3.2235 3.5509 2.8132 3.0502 1.4931 3.1314 3.2832 2.8557 3.2902 2.6930 2.7461 1.3883 2.4045 2.5347 3.6863 2.8203 2.7988 2.7785 3.8496 3.3099 2.9299 3.6000 3.5854 3.7461 3.7194 2.1486 2.8751 2.1877 2.1697 2.7120 2.4950 3.1989 1.5180 1.9300 2.1786 2.0222 1.8230 1.8994 1.8863 2.3783 2.1451 2.7628 2.2497 2.6253 2.2809 2.5688 2.9138 2.0169 2.6091 3.0664 2.4758 2.4734 1.8896 1.6074 2.5285 2.0461 1.8377 1.4832 2.2979 1.6371 1.3951 1.4661 1.7749 1.8416 2.1137 1.8238 1.6609 1.3259 1.6236 1.5893 1.5736 1.6549 1.5424 1.5366 1.9967 1.3610 1.3750 1.3427 1.4049 1.4375 1.3558 1.2994 1.4569 1.9474 1.4404 1.4000 1.4544 1.5103 1.3373 1.1673 1.2000 1.1783 1.0758 1.0788 1.0914 1.0870 1.0822 1.0806 1.0883 1.0770 1.0649 1.0571 1.0564 1.0654 10.0215 8.3893 7.7827 1.0777 1.0707 1.0786 1.0666 1.0742 1.0582 1.0652 1.0689 1.0626 1.0370 1.0664 1.0639 1.0995 1.0406 1.0841 1.0961 1.0980 1.0982 1.1013 1.0957 1.0906 1.0991 1.0963 1.0991 1.0976 1.0985 1.0912 1.0642 1.0642 1.0660
irintensity: 0.5166 4.7567 1.9851 1.2310 0.5155 4.7329 6.4038 8.9460 1.7543 56.9263 35.5754 3.6235 3.2189 6.9147 1.9736 0.1471 0.3008 2.2814 1.7954 8.4451 0.3860 3.3193 4.5814 6.5066 12.6897 16.2797 7.2241 5.4410 4.6093 73.9055 19.5206 3.2972 5.9677 3.1621 12.6516 5.6209 135.1859 24.0104 19.6108 4.7907 2.6773 8.0271 1.8314 2.0545 3.7256 1.4309 14.6627 21.9854 10.0424 0.3427 6.8170 0.3537 0.8483 4.0778 10.3210 21.2794 29.0115 11.3320 17.6970 37.7587 2.4515 4.3846 19.4432 1.5120 5.3520 12.0943 40.3468 1.8297 17.2640 11.8628 41.8752 70.6148 13.2084 53.2962 35.0521 0.7587 3.3872 25.7233 12.8202 16.4040 4.2552 11.9449 29.7485 18.2112 26.5850 0.7783 5.6055 1.3987 35.5818 10.7599 0.9750 56.1002 12.3015 48.2529 2.7008 13.2487 112.9508 14.3795 10.6183 39.2079 0.4522 2.2054 14.6389 3.5764 8.5488 1.8829 5.5401 0.9232 5.1729 1.8776 5.4518 2.5719 1.7828 80.5692 49.2818 12.5330 38.9854 19.6437 18.4748 1.4064 20.6362 19.1957 5.4681 9.4925 3.5245 3.7729 9.5666 4.8571 7.3789 169.1970 60.0358 189.6983 5.3922 51.2321 16.7688 14.2805 7.0876 42.9344 16.5178 48.6314 24.2801 25.4674 13.6005 19.9064 10.5340 10.8902 50.2687 41.5329 7.9851 62.7088 28.4438 21.9134 4.2173 34.9865 23.4385 26.3378 23.7485 24.0521 9.8192 21.6681 20.8417 20.6075
temp: 298.150 k
press: 1.00000 atm
elementType: 8 8 8 8 8 6 6 6 6 6 6 6 6 6 6 6 6 6 6 6 6 6 6 6 6 6 1 1 1 1 1 1 1 1 1 1 1 1 1 1 1 1 1 1 1 1 1 1 1 1 1 1 1 1 1 1
symmnumber: 1
zpe: 1241901.0 jmol-1
zpe.correction: 0.473015 hartree
zpe.thermalcorrener: 0.498577 hartree
zpe.thermalcorrenthalpy: 0.499521 hartree
zpe.thermalcorrgfe: 0.418805 hartree
zpe.sumelectzpe: -1192.320531 hartree
zpe.sumelectthermal: -1192.294969 hartree
zpe.sumelectthermalent: -1192.294025 hartree
zpe.sumelectthermalfe: -1192.374741 hartree
dipole: 1.3750 -0.7691 1.5639
dipole: 2.2199
quadrupole: -239.9155 -159.9739 -154.2278
quadrupole: -0.2893 14.4116 1.9823
quadrupole: -55.2098 24.7319 30.4779 -0.2893 14.4116 1.9823
hfenergy: -1192.7935463 hartree
pointgroup: C01 [X(C21H30O5)]
dipole: 0.5563815 0.3907265 -0.548218 debye
polarizability: 305.2467487|-0.6142348|211.2940784|21.6203468|7.0763615|192.2094509 unknown
InChI: InChI=1S/C21H30O5/c1-19-7-5-13(23)9-12(19)3-4-14-15(19)6-8-20(2)16(14)10-17(24)21(20,26)18(25)11-22/h9,14-17,22,24,26H,3-8,10-11H2,1-2H3
charge 0 multiplicity 1
56 atoms
O  -3.188282 -0.549072 1.575295
O  -3.967512 -2.720565 0.402703
O  -4.860846 0.539243 -1.443094
O  -6.187887 2.088915 0.288827
O  6.571274 0.216506 1.504689
C  -1.795477 0.189464 -0.411732
C  -0.91134 -1.084941 -0.188713
C  0.543027 -0.904672 -0.670014
C  1.17927 0.312784 0.076031
C  -3.190284 -0.357013 0.105997
C  -1.17706 1.364355 0.388092
C  2.691301 0.57737 -0.32135
C  -1.766669 -2.234895 -0.768535
C  0.302697 1.594339 -0.029099
C  -3.254413 -1.824774 -0.495956
C  1.377908 -2.178633 -0.41227
C  -1.918068 0.582985 -1.908669
C  3.474599 -0.743807 -0.195709
C  2.854767 -1.977129 -0.825753
C  3.285027 1.642036 0.654628
C  2.822207 1.080479 -1.795309
C  -4.40989 0.484805 -0.262887
C  4.826269 1.709803 0.648922
C  4.701231 -0.823074 0.414177
C  5.450422 0.343177 0.922902
C  -5.131507 1.265929 0.833814
H  -0.858048 -1.241356 0.912392
H  0.542016 -0.711323 -1.763473
H  1.201962 0.023181 1.15324
H  -1.177627 1.149544 1.481447
H  -1.751232 2.300021 0.240234
H  -1.59264 -2.347939 -1.855148
H  -1.567656 -3.211637 -0.297013
H  0.326469 1.987742 -1.061926
H  0.722242 2.387201 0.61645
H  -3.853829 -1.811846 -1.419765
H  0.952749 -3.033744 -0.970743
H  1.326567 -2.437293 0.665563
H  -2.437579 -0.183665 -2.505072
H  -2.491749 1.51857 -2.023523
H  -0.92405 0.741998 -2.356163
H  2.893414 -1.871088 -1.93131
H  3.455348 -2.870343 -0.57563
H  2.948278 1.401685 1.68394
H  2.879453 2.640509 0.406849
H  3.884623 1.182796 -2.07895
H  2.355246 0.385952 -2.51543
H  2.347024 2.069643 -1.919321
H  -2.55976 0.083628 2.003731
H  5.202192 2.428461 1.398344
H  5.197841 2.058528 -0.336593
H  5.212328 -1.790441 0.507161
H  -3.712418 -2.458424 1.329421
H  -4.409725 1.909472 1.378245
H  -5.530575 0.534218 1.566521
H  -6.287027 1.837636 -0.673665
