program: Gaussian 09
title: 000192867
version: EM64L-G09RevD.01
frameworkgroup: C1[X(C21H32O6)]
method: RPBEPBE
basis: SDD
operation: Freq
keyword: #pfreq=noraman
keyword: PBEPBE/SDD
title: #p freq=noraman PBEPBE/SDD
converged: YES YES NO NO
title: Mulliken charges:
elementType: O O O O O O C C C C C C C C C C C C C C C C C C C C C H H H H H H H H H H H H H H H H H H H H H H H H H H H H H H H H
charge: -0.466580 -0.459413 -0.193283 -0.431830 -0.236779 -0.445446 -0.146074 -0.123260 -0.283025 0.297471 0.352970 -0.069337 0.186753 -0.499710 -0.550136 -0.630959 -0.486515 0.124965 -0.231132 -0.559344 -0.530938 -0.796860 -0.866268 -0.486482 -0.090019 0.056220 -0.364053 0.250498 0.181893 0.226405 0.234190 0.221741 0.208959 0.229889 0.243887 0.254817 0.249690 0.203512 0.218353 0.272329 0.280066 0.236684 0.191044 0.223026 0.245192 0.242003 0.237059 0.222521 0.260753 0.223079 0.184559 0.243889 0.261719 0.349404 0.349385 0.244708 0.257747 0.312982 0.367078
chargesum: 0.00000
title: Mulliken charges with hydrogens summed into heavy atoms:
elementType: O O O O O O C C C C C C C C C C C C C C C C C C C C C
charge: -0.117176 -0.110028 -0.193283 -0.118848 -0.236779 -0.078368 0.104424 0.058633 -0.056620 0.297471 0.352970 0.164853 0.186753 -0.069010 -0.076360 -0.126452 -0.064650 0.124965 0.041197 -0.042594 -0.116868 -0.072606 -0.159914 -0.058033 0.171700 0.056220 0.138402
polarizability: 2.74961188e+02 -3.10985168e+00 2.18351078e+02 2.58133333e-01 4.09711336e-01 2.05624414e+02
1716.lowfreq: -5.5071 -0.0004 0.0003 0.0006 13.1290 16.0139 33.6241 44.1946 48.4547
frequency: 33.0675 43.9972 48.4224 68.5381 82.6458 89.4028 114.6583 125.9517 147.6949 156.3411 165.5863 172.4681 184.9366 199.1790 213.6672 219.5217 227.8942 241.9416 254.4215 264.7602 269.5322 287.8163 293.9819 301.6037 312.8348 323.5752 325.9489 333.9919 345.1899 358.2955 374.6386 377.5576 385.9860 389.8441 398.4933 407.8823 435.1178 443.2655 451.8485 466.8255 492.4502 506.6328 517.3623 549.6285 577.7803 593.0585 609.8738 631.6260 648.3647 668.5803 717.3245 736.1577 757.3138 786.0596 798.2512 818.7514 829.1743 848.0149 871.2378 885.7424 893.1876 895.8285 904.8780 914.5963 931.9566 940.9065 947.6549 964.1753 972.4577 982.8543 984.7613 994.5743 1008.1520 1014.6965 1021.0880 1036.1859 1038.2934 1047.0804 1055.7619 1064.8687 1079.7269 1098.2067 1101.9140 1111.5604 1114.1821 1125.4691 1135.4835 1139.0704 1147.2956 1156.8402 1162.2700 1173.6791 1176.2489 1189.9083 1200.2219 1205.1848 1213.4296 1220.5994 1224.4816 1241.2744 1246.3749 1250.5364 1260.9413 1267.1722 1275.8156 1283.7457 1293.1871 1294.5361 1298.3592 1310.8257 1314.6609 1321.2815 1329.8612 1337.8204 1340.2556 1343.7274 1349.9976 1352.9417 1359.3647 1365.3912 1372.4241 1381.7737 1386.5025 1390.4456 1410.0535 1431.8265 1446.4299 1452.6011 1464.9409 1465.7361 1471.3526 1471.9331 1475.3129 1483.9601 1486.2435 1492.2738 1498.5760 1600.4189 1613.7327 2883.8729 2931.1447 2952.3863 2964.8729 2970.4670 2976.4315 2978.3853 2983.8803 2985.3688 2989.7597 2990.2259 2998.3398 3004.2796 3015.6547 3016.5090 3023.6306 3031.3202 3034.9341 3037.3985 3061.4254 3062.0595 3066.2139 3076.7826 3080.0788 3082.9960 3083.8188 3086.0020 3101.6129 3434.4428 3534.0521 3587.3221 3588.8582
redmass: 6.5625 5.2571 7.0537 5.5023 3.6871 5.1379 2.7258 3.8328 2.8563 4.4402 2.4537 2.3403 2.1841 3.0169 1.9136 2.4723 2.1627 2.0670 1.3909 2.9496 1.7412 3.3348 1.9392 2.4770 2.8882 2.5329 2.5728 5.0383 1.6306 2.9704 1.4245 2.9342 2.7807 3.4144 3.3008 3.2091 2.7800 2.8874 1.8841 2.3267 3.5913 3.8033 3.4341 3.5203 2.7462 3.7496 3.1916 3.3106 2.8278 4.0304 4.1698 3.8159 3.3802 1.9608 2.3095 2.2991 2.5084 2.1888 2.6144 2.6824 2.5539 2.4957 2.1584 2.2033 2.4124 2.0860 2.0787 2.0755 2.1385 2.5478 2.8002 2.4927 2.5351 3.1131 2.1869 1.9443 1.7837 2.2621 2.6397 2.1604 2.2716 2.0608 1.8772 1.9768 1.8281 1.5803 2.1444 2.1078 1.9417 1.5229 1.9764 1.4870 1.4463 1.7316 1.8795 1.7667 1.2545 2.0087 1.6038 1.5753 1.3618 1.6812 1.3468 1.3310 1.4151 1.4154 1.3888 1.3763 1.4465 1.4336 1.3972 1.4004 1.4718 1.4877 1.9597 1.3795 1.4925 1.4064 1.4817 1.4301 1.2076 1.4222 1.2340 1.2867 1.1842 1.0809 1.0860 1.0938 1.0683 1.0771 1.0891 1.0919 1.0722 1.0566 1.0581 1.0748 1.0531 8.2297 8.9499 1.0801 1.0781 1.0648 1.0623 1.0671 1.0672 1.0593 1.0612 1.0530 1.0683 1.0702 1.0394 1.0604 1.0973 1.0665 1.0971 1.0947 1.0867 1.1013 1.0907 1.1008 1.1003 1.0976 1.0910 1.1028 1.0983 1.0987 1.0992 1.0643 1.0658 1.0663 1.0660
irintensity: 0.8855 0.4282 1.2017 4.2847 4.2413 2.4997 6.4666 1.0258 1.0213 6.0924 2.7986 55.2475 71.0025 0.5874 3.6969 13.1120 19.4419 8.6248 3.0218 21.1941 23.5293 35.5566 2.9055 24.3705 3.1984 43.5803 68.7998 25.7047 59.1727 0.9651 50.7650 26.5672 11.6790 7.3193 4.6528 17.2727 1.4021 7.8097 2.2743 17.2330 14.8006 3.4743 11.5409 12.9071 1.7909 5.1890 0.1297 16.3216 5.7956 11.2573 0.2222 1.4132 1.0613 2.6927 0.8764 5.0203 7.4237 9.6524 11.9389 24.4296 9.1131 36.9393 15.9689 19.8673 22.1873 5.2002 12.2121 11.9677 20.4399 4.7836 70.4390 35.2351 57.3888 57.6127 29.1755 6.8595 36.9182 24.4940 15.4008 3.7572 45.2845 40.9187 7.2384 24.6174 21.4820 12.0135 21.8002 14.7398 12.2965 19.6475 1.5779 24.9353 2.2130 10.4936 46.4771 9.0240 6.6302 2.8424 42.6953 11.9663 124.6653 25.0064 26.8941 6.5352 13.9415 9.7111 14.7111 3.9352 2.8186 25.7891 1.4345 6.2338 1.6026 2.2736 41.3188 1.2698 2.3185 3.4447 16.8945 0.7140 38.4189 51.3404 10.9146 21.3584 31.8929 20.1408 9.0412 9.2437 7.8920 20.5254 1.8385 10.1764 12.7353 2.9783 9.4196 7.7029 4.5934 78.6445 126.4422 27.8390 8.6873 8.9246 26.6418 36.5330 21.4671 33.1940 10.1975 1.5405 32.2287 54.8901 14.6840 21.8329 4.6351 22.5763 24.2710 61.1194 6.6852 62.7899 20.8426 10.8918 18.1983 26.5745 37.5163 21.1396 25.4348 19.8995 15.6586 19.5374 6.1476 9.3966 6.9644
temp: 298.150 k
press: 1.00000 atm
elementType: 8 8 8 8 8 8 6 6 6 6 6 6 6 6 6 6 6 6 6 6 6 6 6 6 6 6 6 1 1 1 1 1 1 1 1 1 1 1 1 1 1 1 1 1 1 1 1 1 1 1 1 1 1 1 1 1 1 1 1
symmnumber: 1
zpe: 1313628.7 jmol-1
zpe.correction: 0.500335 hartree
zpe.thermalcorrener: 0.527191 hartree
zpe.thermalcorrenthalpy: 0.528135 hartree
zpe.thermalcorrgfe: 0.446417 hartree
zpe.sumelectzpe: -1268.636829 hartree
zpe.sumelectthermal: -1268.609973 hartree
zpe.sumelectthermalent: -1268.609029 hartree
zpe.sumelectthermalfe: -1268.690747 hartree
dipole: 0.0606 5.3011 0.0042
dipole: 5.3014
quadrupole: -217.6850 -168.2085 -160.0652
quadrupole: 9.4303 12.6918 2.3022
quadrupole: -35.6987 13.7777 21.9210 9.4303 12.6918 2.3022
hfenergy: -1269.137164 hartree
pointgroup: C01 [X(C21H32O6)]
dipole: -0.0732641 2.0822202 0.0965053 debye
polarizability: 274.7810901|4.4268388|218.5390959|0.569667|0.2118439|205.6164936 unknown
InChI: InChI=1S/C21H32O6/c1-19-9-15(24)18-13(14(19)5-6-21(19,27)17(26)10-22)4-3-11-7-12(23)8-16(25)20(11,18)2/h11-14,16,18,22-23,25,27H,3-10H2,1-2H3
charge 0 multiplicity 1
59 atoms
O  -3.039609 0.191812 -2.027437
O  4.571901 -1.682577 1.020744
O  0.452352 -2.378072 1.10706
O  4.875228 -0.092642 -2.885977
O  -5.203466 -0.089015 0.780352
O  -5.999681 -2.282474 -0.542099
C  0.3302 1.188293 0.661545
C  -1.033788 1.250675 -0.054873
C  1.075434 -0.140539 0.240444
C  -1.950031 0.02115 0.250685
C  2.509787 -0.261845 0.870576
C  3.341886 1.022177 0.499317
C  -3.243294 0.442041 -0.581568
C  1.199501 2.429116 0.343457
C  -1.962125 2.468466 0.180234
C  -1.23868 -1.267694 -0.230297
C  2.61857 2.318246 0.942839
C  0.141125 -1.356556 0.435536
C  3.273841 -1.524737 0.316941
C  -3.377041 1.967863 -0.270641
C  3.733522 1.086267 -1.004916
C  -2.290251 -0.112018 1.758452
C  2.424493 -0.401641 2.419029
C  3.651257 -1.43497 -1.172434
C  4.486934 -0.175569 -1.462503
C  -4.488645 -0.369793 -0.224193
C  -4.863847 -1.570531 -1.086373
H  0.15526 1.167894 1.755749
H  -0.800019 1.213058 -1.147002
H  1.188377 -0.055872 -0.864818
H  4.292334 0.940126 1.065779
H  0.697013 3.334054 0.736385
H  1.26088 2.557213 -0.757166
H  -1.635072 3.356936 -0.386451
H  -1.967156 2.749342 1.249513
H  -1.130775 -1.232689 -1.332788
H  -1.799476 -2.180858 0.036143
H  3.220734 3.197329 0.63965
H  2.55139 2.35176 2.047672
H  2.653464 -2.420918 0.498873
H  -4.12955 2.111615 0.523022
H  -3.750084 2.493049 -1.16869
H  2.83746 1.214632 -1.649664
H  4.373222 1.972978 -1.176254
H  -2.832058 0.763926 2.150909
H  -2.927174 -0.995374 1.937465
H  -1.374429 -0.250737 2.359323
H  1.749964 0.34354 2.873146
H  2.047365 -1.40031 2.701577
H  3.42067 -0.246743 2.871908
H  2.731801 -1.425344 -1.795343
H  4.225791 -2.336688 -1.447335
H  5.453045 -0.250688 -0.937397
H  -2.436569 0.885383 -2.392567
H  4.399659 -2.075786 1.911659
H  -3.991525 -2.250215 -1.169534
H  -5.079886 -1.2085 -2.111182
H  4.048264 -0.059451 -3.433433
H  -6.308499 -1.7744 0.260847
