program: Gaussian 09
title: 000192843
version: EM64L-G09RevD.01
frameworkgroup: C1[X(C6H10O3)]
method: RPBEPBE
basis: SDD
operation: Freq
keyword: #pfreq=noraman
keyword: PBEPBE/SDD
title: #p freq=noraman PBEPBE/SDD
converged: YES YES NO NO
title: Mulliken charges:
elementType: O O O C C C C C C H H H H H H H H H H
charge: -0.465093 -0.231873 -0.215883 0.117641 -0.706413 0.167998 0.198533 -0.764643 -0.752329 0.246089 0.249031 0.230629 0.288601 0.251818 0.253826 0.246558 0.273928 0.246171 0.365411
chargesum: 0.00000
title: Mulliken charges with hydrogens summed into heavy atoms:
elementType: O O O C C C C C C
charge: -0.099682 -0.231873 -0.215883 0.117641 0.019335 0.167998 0.198533 0.029601 0.014329
polarizability: 7.92262587e+01 -5.76336938e-01 7.80922400e+01 1.36031943e+00 4.06431579e+00 6.41358889e+01
1716.lowfreq: -10.4844 -7.0804 -0.0009 -0.0007 0.0005 16.3808 51.7969 78.6823 130.9069
frequency: 51.6381 78.6551 130.6917 149.6359 166.4335 209.0253 235.5828 253.2285 317.1162 355.2149 381.5883 445.0452 482.2945 496.5799 551.2762 589.7227 606.2406 656.6004 794.1959 904.9273 952.2823 970.5373 990.0822 1025.4411 1082.5169 1098.1228 1133.8531 1176.0769 1227.1048 1329.9539 1373.3798 1376.5624 1382.7471 1430.6670 1435.2130 1441.1822 1447.1636 1463.5210 1476.1650 1602.7428 1627.2704 2986.5913 2995.2230 3003.2578 3069.7633 3078.6862 3105.2265 3118.5523 3124.8268 3131.7241 3361.5991
redmass: 3.9259 5.9683 1.0396 1.0211 4.2124 1.3091 1.7963 3.4329 3.4174 4.5321 4.8960 3.6576 3.9213 1.4442 2.0783 3.9396 2.5523 3.4210 2.7609 2.4425 2.1003 1.9510 1.5439 1.8522 2.0098 2.3727 2.5715 3.4301 3.7520 1.3990 1.2344 1.1948 1.2340 1.0685 1.0645 1.0585 1.0743 1.0563 1.0504 7.3385 8.3466 1.0381 1.0370 1.0342 1.0937 1.0934 1.1009 1.1012 1.1015 1.1026 1.0637
irintensity: 6.9135 2.0513 0.5511 0.8427 3.6963 0.4822 2.6342 14.2487 6.9863 16.3852 7.0122 9.8460 7.5332 73.0091 25.4448 20.6859 0.8874 5.0907 26.0026 6.8157 39.0324 2.7454 2.2192 11.1234 19.1566 12.0963 97.7472 186.6917 20.1267 120.5646 78.1651 12.2671 68.6627 29.0864 27.3341 24.4911 27.4992 4.5058 16.1634 141.7573 54.6780 3.6178 1.1435 13.6330 4.7512 4.3413 13.4356 11.4734 3.5767 12.6054 50.3022
temp: 298.150 k
press: 1.00000 atm
elementType: 8 8 8 6 6 6 6 6 6 1 1 1 1 1 1 1 1 1 1
symmnumber: 1
zpe: 394012.4 jmol-1
zpe.correction: 0.150071 hartree
zpe.thermalcorrener: 0.160916 hartree
zpe.thermalcorrenthalpy: 0.161860 hartree
zpe.thermalcorrgfe: 0.114113 hartree
zpe.sumelectzpe: -459.584738 hartree
zpe.sumelectthermal: -459.573893 hartree
zpe.sumelectthermalent: -459.572949 hartree
zpe.sumelectthermalfe: -459.620696 hartree
dipole: -0.5087 0.5570 0.2103
dipole: 0.7831
quadrupole: -53.1116 -60.3865 -53.1143
quadrupole: -7.0552 -3.6170 1.2443
quadrupole: 2.4259 -4.8490 2.4231 -7.0552 -3.6170 1.2443
hfenergy: -459.7348091 hartree
pointgroup: C01 [X(C6H10O3)]
dipole: -0.1195205 0.0690976 -0.2754196 debye
dipolederiv: -0.3742796 0.0923205 -0.0497202 0.1368843 -0.5184594 -0.0933363 0.025251 -0.0199482 -0.7423469 -0.8050502 -0.1513592 0.1606645 -0.2656907 -0.3236497 0.0167176 0.2872889 0.0030888 -0.7203799 -0.5755055 0.1626908 0.1134471 0.1941279 -0.4114316 -0.0405055 0.243602 -0.0502158 -0.811328 -0.6872387 0.018039 -0.1133769 0.0255103 0.0710991 0.0184933 -0.1524386 0.077649 0.4334228 0.0573258 -0.0027441 0.0047811 -0.0053151 0.0362096 0.0774016 0.0077398 -0.0583952 -0.0304792 1.1327484 0.3069632 -0.0557151 0.5697191 0.1353128 0.02115 -0.0077062 0.0291242 0.8316299 0.8417442 -0.4938342 0.0468817 -0.7018483 0.4155323 -0.170038 -0.1890915 -0.0852574 0.898633 -0.1065152 -0.0210807 -0.1119446 -0.0141906 0.0155401 -0.0231854 -0.068495 -0.0625091 -0.4779644 -0.0716141 0.0922276 -0.1439929 0.1218376 -0.0613404 0.1548236 -0.1871287 0.1803119 -0.3998597 0.1020193 0.0014082 0.0314455 0.0085006 0.0770899 -0.0583004 0.017841 -0.0111142 -0.0751913 -0.0192974 -0.1036377 -0.0553208 -0.0682512 0.0279729 -0.0079777 -0.067357 -0.0303016 0.0731105 -0.0465343 0.1195904 0.0096889 0.0775709 -0.0017361 0.0196364 0.0171614 0.0217128 0.093834 0.0749123 0.046596 0.07808 0.019168 0.1140349 -0.0400422 0.0300784 -0.0036701 0.1238462 0.1300401 0.0273694 -0.0279824 0.0487111 -0.0345373 0.0533079 -0.0152416 0.0335123 0.0885089 0.0025938 -0.1041015 -0.0315751 -0.1165481 0.0307305 -0.0467169 -0.0021987 0.0010835 0.0826336 -0.0038264 0.1113267 0.0133895 0.1195575 0.0216697 -0.0044916 0.0470003 -0.0402613 0.0697672 0.1085709 -0.0116968 -0.0555181 -0.0558017 0.0191026 -0.0573514 -0.0228301 -0.0518798 0.0973598 -0.0200094 -0.0814167 0.0550315 -0.026976 0.0842176 0.0676313 0.043244 0.0245269 0.0992436 0.259916 -0.008661 0.1317364 -0.0669655 0.3026424 0.1127837 -0.0067194 0.0425434 0.3655599 unknown
polarizability: 79.2140511|-0.5476322|63.0567794|0.1653286|-1.4661766|79.1835571 unknown
InChI: InChI=1S/C6H10O3/c1-4(7)6(3,9)5(2)8/h9H,1-3H3
charge 0 multiplicity 1
19 atoms
O  -0.109827 0.777289 1.550221
O  -2.189965 -0.544184 0.66428
O  1.513067 -0.757325 -1.31631
C  -0.053796 0.454823 0.135811
C  0.159213 1.752801 -0.679307
C  -1.38233 -0.259567 -0.266717
C  1.125948 -0.548384 -0.137451
C  -1.647468 -0.564223 -1.718771
C  1.739871 -1.218215 1.071134
H  0.37794 1.523553 -1.734721
H  1.015186 2.299766 -0.249873
H  -0.730498 2.401562 -0.609328
H  -0.730483 -0.916412 -2.222602
H  -1.958498 0.363445 -2.237618
H  -2.45817 -1.30339 -1.810128
H  2.529469 -1.91543 0.751917
H  2.146078 -0.455297 1.758294
H  0.964702 -1.754917 1.649289
H  -0.958842 0.375806 1.902981
