program: Gaussian 09
title: 000192842
version: EM64L-G09RevD.01
frameworkgroup: C1[X(C6H10O4)]
method: RPBEPBE
basis: SDD
operation: Freq
keyword: #pfreq=noraman
keyword: PBEPBE/SDD
title: #p freq=noraman PBEPBE/SDD
converged: YES YES NO NO
title: Mulliken charges:
elementType: O O O O C C C C C C H H H H H H H H H H
charge: -0.464903 -0.228208 -0.413094 -0.218859 -0.488142 -0.091470 0.188865 -0.488536 -0.685679 0.201428 0.243804 0.260408 0.231074 0.253112 0.268491 0.253888 0.196964 0.235134 0.361624 0.384100
chargesum: 0.00000
title: Mulliken charges with hydrogens summed into heavy atoms:
elementType: O O O O C C C C C C
charge: -0.103280 -0.228208 -0.028995 -0.218859 0.016070 0.139603 0.188865 0.033067 0.000307 0.201428
polarizability: 8.52590923e+01 6.65669903e+00 7.61058215e+01 4.42272646e-01 1.16258849e+00 6.63439923e+01
1716.lowfreq: -14.0540 -0.0012 -0.0010 -0.0009 6.5038 14.7563 32.3904 65.4331 68.3828
frequency: 32.0421 65.4176 68.3693 94.0728 177.7087 206.7449 227.9543 245.4659 316.7733 379.0590 400.4015 445.3216 480.1586 503.8882 543.7031 610.1010 614.3649 656.8289 742.6479 790.6764 881.5432 905.5889 935.3094 1012.7134 1041.7360 1060.5341 1073.4293 1104.4727 1152.1543 1193.3402 1220.3772 1242.2491 1268.9077 1299.3876 1328.8799 1369.7729 1374.9021 1383.4140 1435.7046 1444.4209 1459.4051 1477.2941 1608.2950 1666.0951 2973.5819 2987.1649 2989.0111 3007.6916 3065.5160 3078.4206 3087.4089 3106.5046 3405.3187 3512.9803
redmass: 7.8741 5.6322 5.0641 5.8942 2.7458 1.4462 2.4461 1.9840 4.6699 5.0026 2.8890 1.2206 2.1251 2.8181 3.8068 2.1888 2.8923 1.8116 3.0661 3.0063 2.5693 1.9518 2.0016 1.9325 2.9568 2.1666 2.4511 2.1982 1.5413 1.3289 1.3179 1.7258 1.6266 1.2799 1.4467 1.7293 1.4207 1.2394 1.0751 1.0838 1.0650 1.0495 9.2526 8.3372 1.0819 1.0634 1.0372 1.0647 1.0953 1.0959 1.0989 1.1005 1.0640 1.0641
irintensity: 0.3590 1.0871 0.6790 1.9671 0.6778 0.4621 3.1277 1.6691 19.4655 22.3464 22.3694 65.9627 21.5525 61.2575 5.5613 42.6655 12.2088 96.0138 12.4559 6.5986 13.4352 13.7741 25.8158 58.7580 197.2934 88.4760 100.4370 14.9965 11.3677 3.4798 3.9306 74.4406 16.6108 4.1317 4.8257 95.3313 25.0550 25.6485 28.4714 40.5570 4.4713 12.1427 88.1293 208.2844 37.7859 11.8210 22.1434 7.2959 2.2152 17.6332 36.9700 15.2001 38.6188 31.8083
temp: 298.150 k
press: 1.00000 atm
elementType: 8 8 8 8 6 6 6 6 6 6 1 1 1 1 1 1 1 1 1 1
symmnumber: 1
zpe: 411247.6 jmol-1
zpe.correction: 0.156636 hartree
zpe.thermalcorrener: 0.167883 hartree
zpe.thermalcorrenthalpy: 0.168827 hartree
zpe.thermalcorrgfe: 0.118645 hartree
zpe.sumelectzpe: -534.732843 hartree
zpe.sumelectthermal: -534.721596 hartree
zpe.sumelectthermalent: -534.720652 hartree
zpe.sumelectthermalfe: -534.770834 hartree
dipole: 3.2795 3.4717 1.6927
dipole: 5.0669
quadrupole: -59.3681 -63.3021 -59.3806
quadrupole: -3.9745 -5.3636 1.8034
quadrupole: 1.3155 -2.6185 1.3030 -3.9745 -5.3636 1.8034
hfenergy: -534.8894787 hartree
pointgroup: C01 [X(C6H10O4)]
dipole: -1.0914353 1.2352967 -1.1210336 debye
dipolederiv: -0.6381538 0.1143932 -0.0915297 0.0434626 -0.4006114 0.1489233 -0.1096762 0.2053251 -0.6422551 -0.5370305 0.1566654 -0.1275446 0.1431409 -0.8530643 -0.0030953 -0.1874388 -0.0268522 -0.4097199 -1.1232429 0.4378225 0.0402158 0.4331788 -0.6185361 -0.1162875 0.1360378 -0.177958 -0.3016794 -0.686723 0.1273926 0.1309072 0.2858823 -0.6347545 0.169288 -0.0636916 0.3135446 -0.5909616 -0.049595 0.0691265 -0.1538956 0.0621071 0.0001819 0.0368579 -0.2500956 0.0787189 -0.1390378 0.3627249 -0.2144391 -0.026305 -0.2820727 0.0678634 -0.2931187 -0.0419415 -0.2403872 0.3226485 0.6343448 -0.0973899 0.2935447 -0.0613885 0.9146498 0.0493656 0.3934299 0.1328046 0.4118333 -0.0458274 0.0249535 0.1056324 -0.0895355 0.0210898 0.1445122 0.1806404 0.0853741 -0.1246728 0.0346402 -0.0800793 0.0586201 -0.0451399 -0.0059503 0.0765615 -0.0153715 -0.0109852 -0.0484836 1.3496113 -0.5415914 -0.2925211 -0.6493994 0.8670669 -0.2825813 -0.2374551 -0.3335153 0.7559502 0.0011106 -0.0005949 0.0861463 -0.0160741 0.0813353 0.0754787 0.0779554 0.0400597 0.0001618 -0.0032242 -0.0365017 -0.0606472 -0.0439946 -0.0356653 -0.0615532 -0.0366672 -0.0177019 0.0932324 -0.1115496 0.0797175 0.0463677 0.1100757 -0.0102553 0.004543 0.0929778 -0.023165 0.0113256 0.0905862 -0.0828539 0.0330401 -0.054548 -0.0243481 -0.0583086 0.0146493 -0.0677437 0.0587989 -0.0229864 0.0476904 -0.081223 0.0485107 0.1093029 0.0103 -0.0601887 0.0294443 0.0077667 0.0377004 -0.0906985 -0.0406222 -0.0847577 -0.0136623 -0.0679481 -0.0578642 -0.0793927 0.0347172 -0.0323347 0.1071088 -0.1016408 0.0903775 0.0205397 0.0848865 -0.0933577 0.087737 -0.0088759 -0.0058482 0.031348 0.0915875 0.0893017 0.032061 -0.0667568 0.1000008 -0.0271603 0.0157903 0.3908423 -0.0523981 0.0396169 0.046043 0.1760343 0.0217888 0.0822759 -0.0762306 0.3781475 0.3549549 0.0003284 0.0502507 -0.02517 0.3067224 0.1271441 0.0757808 0.1080835 0.1753135 unknown
polarizability: 83.1032775|-7.3501996|76.2543454|2.4298723|-4.572453|68.3512832 unknown
InChI: InChI=1S/C6H10O4/c1-4(7)5(8)2-3-6(9)10/h4,7,9H,2-3H2,1H3
charge 0 multiplicity 1
20 atoms
O  2.525639 -0.221331 1.450676
O  1.298189 -1.883687 -0.211376
O  -3.118517 1.184038 0.400698
O  -1.684172 -0.503701 1.102825
C  -0.152155 -0.306725 -1.362603
C  1.581546 0.394924 0.534321
C  0.902379 -0.69045 -0.325932
C  -1.169027 0.77838 -0.949494
C  2.326087 1.427906 -0.347385
C  -1.974584 0.387775 0.276445
H  0.390914 0.054779 -2.260341
H  -0.669319 -1.236571 -1.655707
H  0.799139 0.906814 1.13185
H  -0.672001 1.74313 -0.729267
H  -1.869473 0.985437 -1.777578
H  2.856049 2.132608 0.314426
H  1.637252 2.004259 -0.992285
H  3.076731 0.923756 -0.980585
H  2.502923 -1.204966 1.267614
H  -3.613499 0.929825 1.226798
