program: Gaussian 09
title: 000192837
version: EM64L-G09RevD.01
frameworkgroup: C1[X(C7H7N2)]
method: RPBEPBE
basis: SDD
operation: Freq
keyword: #p
keyword: freq=noraman
keyword: PBEPBE/SDD
title: #p freq=noraman PBEPBE/SDD
converged: NO YES NO YES
title: Mulliken charges:
elementType: N N C C C C C C C H H H H H H H
charge: 0.025923 0.156379 0.341360 0.252495 -0.327050 -0.767621 -0.305390 -0.168340 -0.176689 0.287488 0.265365 0.265406 0.278879 0.294693 0.284945 0.292158
chargesum: 1.00000
title: Mulliken charges with hydrogens summed into heavy atoms:
elementType: N N C C C C C C C
charge: 0.025923 0.156379 0.341360 0.252495 -0.039562 0.042028 -0.010697 0.116605 0.115468
polarizability: 1.34274116e+02 5.02539296e+00 9.11562016e+01 1.66891363e-02 3.21379295e-03 3.70236065e+01
1716.lowfreq: -11.3920 -3.2281 -0.0006 -0.0004 -0.0004 10.0863 73.9785 124.2795 146.5695
frequency: 73.9124 124.2717 146.5688 210.2918 328.9561 380.1720 440.1782 453.1849 531.3291 557.6120 588.2013 681.7624 705.7559 773.9984 809.4114 877.7234 975.6464 984.3174 1017.6466 1038.2225 1042.1092 1103.7238 1175.0245 1195.0521 1213.5290 1294.6164 1377.5992 1406.3873 1414.8358 1462.2095 1466.6965 1476.2585 1542.9775 1587.5445 2101.7222 2983.5253 3057.3425 3121.1996 3162.3836 3170.7957 3178.3700 3193.4399
redmass: 1.0444 4.3782 6.6040 3.4391 3.2211 3.8396 6.9840 2.9667 5.7722 6.1670 7.5141 2.8625 5.3570 1.3126 5.0390 1.2584 1.3498 1.6547 1.3999 2.1392 1.5578 2.8407 2.3056 1.0834 2.4975 1.4804 4.9646 1.3330 1.7693 1.5942 1.0421 1.5821 5.2935 5.6474 13.8479 1.0408 1.0972 1.0968 1.0897 1.0910 1.0965 1.1015
irintensity: 1.3548 0.0084 0.2570 2.3784 0.0624 0.2211 2.2176 10.4961 1.1649 2.6631 1.0434 7.1295 1.4367 82.0750 0.9146 0.0006 0.2757 0.4409 0.2282 3.1443 9.1904 15.4692 55.2442 2.0468 35.2533 2.8352 31.1677 28.2227 4.2165 10.0549 27.4983 68.3653 22.5021 112.8817 233.1681 1.0960 1.8488 2.7611 0.6627 1.2899 1.1582 1.1362
temp: 298.150 k
press: 1.00000 atm
elementType: 7 7 6 6 6 6 6 6 6 1 1 1 1 1 1 1
symmnumber: 1
zpe: 325542.8 jmol-1
zpe.correction: 0.123993 hartree
zpe.thermalcorrener: 0.132058 hartree
zpe.thermalcorrenthalpy: 0.133003 hartree
zpe.thermalcorrgfe: 0.091037 hartree
zpe.sumelectzpe: -379.514491 hartree
zpe.sumelectthermal: -379.506425 hartree
zpe.sumelectthermalent: -379.505481 hartree
zpe.sumelectthermalfe: -379.547447 hartree
dipole: 0.1097 -0.4095 0.0003
dipole: 0.4239
quadrupole: -30.5387 -33.5717 -51.8321
quadrupole: -0.5679 -0.0007 -0.0005
quadrupole: 8.1088 5.0758 -13.1846 -0.5679 -0.0007 -0.0005
hfenergy: -379.6384838 hartree
pointgroup: C01 [X(C7H7N2)]
dipole: -0.0261874 0.1647193 0.0001103 debye
dipolederiv: 1.7781298 0.3531249 0.0004443 0.1801391 0.0650208 0.0000498 -0.0011658 -0.0002976 0.1959219 -0.7261995 -0.1654701 -0.0007035 -0.0664814 0.0860679 -0.0000893 0.0011645 0.0002702 0.0859666 0.5544837 -0.4469516 -0.0000312 0.3019169 0.3953385 -0.0000971 -0.000194 0.0000159 0.0436351 -1.0156826 -0.2126118 0.000284 -0.0599889 0.0481007 0.0000287 0.000334 0.0000519 0.0502917 -0.4811822 0.519577 0.0000213 0.290021 -0.0961848 0.0000182 0.0000239 0.0000899 -0.0989623 -0.1046391 0.2664936 -0.0000286 0.071763 -0.1206204 0.0000199 -0.0000501 -0.0000406 0.0178735 0.4349521 0.2645428 -0.0000508 -0.3352181 -0.0409461 0.0000601 -0.0002173 -0.0000612 -0.0487388 0.3979892 -0.0038965 0.0000022 0.0290151 0.3784254 -0.0000122 -0.0000108 0.0000169 -0.0022937 -0.3014789 -0.4301197 0.0000343 -0.3213477 -0.1546513 0.0000108 -0.0000027 -0.0000758 -0.1052453 0.1003769 -0.0059681 0.0000037 -0.0227608 0.0205457 -0.0000131 0.0000741 -0.0000472 0.1628464 0.0631894 -0.0072726 0.0789023 -0.0166927 0.0658697 0.0530788 0.0707941 0.0183191 0.0234894 0.0632633 -0.0072242 -0.0788398 -0.0166134 0.0659172 -0.0530353 -0.0707522 -0.0182619 0.023425 0.0436143 -0.1092046 -0.0000361 -0.0366631 0.0306284 -0.0000213 -0.0000069 -0.000022 0.1390833 0.0718261 -0.0371706 -0.0000023 -0.0127044 0.0849482 -0.0000025 0.0000033 0.0000089 0.183144 0.0361773 -0.0071274 -0.0000044 -0.0070059 0.1138556 -0.000002 -0.0000628 -0.0000094 0.1538988 0.0851803 0.0292787 0.0000047 0.0226215 0.0576844 0.0000065 0.0000686 0.0000428 0.1756643 unknown
polarizability: 134.8472344|0.4630638|90.5830829|-0.0169327|-0.0014631|37.0236065 unknown
InChI: InChI=1S/C7H7N2/c1-6-4-2-3-5-7(6)9-8/h2-5H,1H3
charge 1 multiplicity 1
16 atoms
N  1.800186 0.4827 0.000378
N  2.952688 0.598575 -0.001272
C  -0.101857 -1.008705 0.000077
C  0.431702 0.332875 0.000226
C  -1.510697 -1.091209 -0.000004
C  0.788956 -2.226524 0.000078
C  -0.367612 1.522956 0.00018
C  -2.325966 0.066723 0.000001
C  -1.758036 1.371047 0.000096
H  -1.976445 -2.081288 -0.000084
H  1.443569 -2.259152 -0.892022
H  1.443201 -2.259394 0.892443
H  0.189024 -3.148531 -0.000167
H  0.102707 2.51072 0.000254
H  -3.414905 -0.044821 -0.000083
H  -2.401413 2.254829 0.000099
