program: Gaussian 09
title: 000192824
version: EM64L-G09RevD.01
frameworkgroup: C1[X(C24H19BrO4)]
method: RPBEPBE
basis: SDD
operation: Freq
keyword: #p
keyword: freq=noraman
keyword: PBEPBE/SDD
title: #p freq=noraman PBEPBE/SDD
converged: NO YES NO NO
title: Mulliken charges:
elementType: Br O O O O C C C C C C C C C C C C C C C C C C C C C C C C H H H H H H H H H H H H H H H H H H H
charge: 0.023379 -0.310804 -0.309770 -0.203043 -0.203993 0.169616 0.295244 0.365256 -0.474061 0.439952 -0.328757 -0.353274 -0.328880 -0.353399 -0.354623 -0.358770 -0.354630 -0.358801 0.415632 0.412575 -0.353236 -0.353370 -0.222071 -0.222037 -0.228862 0.232805 0.231438 -0.739575 -0.739363 0.230826 0.229304 0.230659 0.229292 0.245379 0.246484 0.245399 0.246527 0.233995 0.234103 0.229666 0.229660 0.231243 0.251261 0.248432 0.251327 0.251716 0.248259 0.251892
chargesum: 0.00000
title: Mulliken charges with hydrogens summed into heavy atoms:
elementType: Br O O O O C C C C C C C C C C C C C C C C C C C C C C C C
charge: 0.023379 -0.310804 -0.309770 -0.203043 -0.203993 0.169616 0.295244 0.365256 -0.474061 0.439952 -0.097931 -0.123969 -0.098221 -0.124107 -0.109244 -0.112286 -0.109230 -0.112273 0.415632 0.412575 -0.119241 -0.119268 0.007594 0.007623 0.002381 0.232805 0.231438 0.011445 0.012503
polarizability: 3.84189977e+02 1.02551445e+01 2.63606875e+02 -9.78496606e-02 7.41792557e-02 2.25993920e+02
1716.lowfreq: -54.5906 -46.4469 -38.9278 -26.3889 -11.3543 -1.5827 -0.0009 -0.0007 0.0007
frequency: -54.5855 -46.4193 -38.8730 -26.1945 -9.7371 18.9140 26.4446 27.1848 33.0087 37.7858 55.5288 60.3587 71.3835 81.1635 93.6154 95.0448 158.3564 159.5317 164.2062 193.1131 206.5199 239.8608 241.1890 309.0099 330.1755 359.8287 363.7537 384.8895 396.5890 399.8081 404.4944 405.3790 466.3110 484.8060 512.3705 512.6660 519.5601 553.9157 554.5753 555.2630 593.1663 609.1021 622.0881 622.9423 628.2525 653.4008 691.6438 697.6260 698.5927 701.3958 739.3478 750.0952 759.9454 794.4943 821.5547 822.4290 829.2862 829.5851 849.4623 849.5042 866.6331 874.6387 919.0422 937.6761 950.5767 953.1843 959.0396 964.7295 975.5369 987.6389 988.0297 989.0542 995.7378 1007.9822 1009.3004 1028.0880 1039.6324 1040.5096 1078.6808 1100.7794 1106.2019 1145.2509 1149.5881 1154.0590 1169.6276 1171.4204 1173.7384 1186.7085 1190.7188 1194.1434 1237.0514 1275.9210 1285.8230 1293.0384 1309.4809 1348.0837 1359.7410 1371.3318 1383.0565 1384.6065 1396.8173 1400.2764 1429.9964 1453.0411 1453.1154 1453.2352 1453.2940 1473.8037 1486.0137 1488.3633 1582.5732 1585.4550 1588.6611 1604.0255 1606.9634 1609.7530 1658.3428 1681.8693 1682.2324 3010.4973 3010.7619 3098.7145 3098.9801 3126.9681 3131.8459 3137.4891 3139.3247 3140.7043 3141.8199 3143.6926 3146.0680 3146.4242 3153.1565 3165.1500 3165.7037 3167.8994 3169.2112 3169.8206
redmass: 3.9684 4.7824 5.3203 6.4236 4.8074 6.4205 6.7310 5.3629 1.3637 1.4690 2.4986 6.6479 8.0130 2.2721 9.0258 3.1757 8.2945 5.2123 8.8249 6.7951 5.5723 6.2721 5.6204 3.9397 4.9409 5.3648 4.6422 5.9085 2.8174 3.1159 4.0294 2.9752 4.3490 3.6070 7.2842 4.2016 4.1335 3.3476 3.1904 3.1871 6.2244 6.8781 5.4172 7.0335 7.1880 4.6496 3.5954 2.2753 8.3823 2.5925 4.4103 4.1146 2.4402 3.5654 2.3668 1.2507 1.2464 3.1413 3.1144 1.2586 5.1959 3.4333 1.7269 2.2922 1.8053 1.3875 1.3813 1.3694 1.3909 2.0482 2.1303 5.3243 1.3286 3.0009 2.6914 2.1561 1.6486 1.6452 1.5937 1.3336 1.3222 3.1299 2.6959 3.0214 1.6291 1.8040 1.0534 1.1253 2.0341 1.9039 4.0037 4.8989 1.2659 1.2618 1.3708 5.3483 6.4682 6.8599 1.2363 1.2370 3.8290 3.6434 2.2405 1.0566 1.0499 1.0470 1.0537 2.2569 2.6110 2.6908 6.1896 7.4780 7.7743 6.2424 6.5717 6.5403 11.4669 10.2146 10.2190 1.0366 1.0367 1.0973 1.0973 1.0847 1.0879 1.0891 1.0889 1.0890 1.0888 1.0923 1.1013 1.1013 1.0969 1.0961 1.0964 1.1017 1.0972 1.0974
irintensity: 0.0170 0.2726 0.5667 0.3814 1.0355 0.0231 0.6351 0.5333 2.8131 0.5413 0.0706 0.7090 0.1937 0.0003 3.8255 3.4667 2.6261 1.0449 0.1343 0.4672 1.3708 0.0598 2.1423 2.4135 6.4372 7.1590 0.6370 6.1637 0.0261 0.0510 0.0002 0.0217 8.6320 7.3227 2.5279 0.6766 0.7525 27.2686 2.6694 2.6914 38.6074 0.0384 96.0024 0.0772 0.0047 5.2606 7.8606 73.9630 0.3670 39.7871 3.5857 5.9379 36.3813 5.1305 6.5298 0.0514 0.1875 19.5359 25.2598 1.0246 200.3836 14.0539 6.6807 3.9602 1.7186 1.0249 0.0495 0.1038 0.0420 221.1337 15.7713 0.0989 0.0058 11.9534 60.4931 5.9653 8.0255 8.2246 9.6745 0.0004 26.0408 1.8847 891.7971 49.8404 357.5461 2.1297 0.0032 1.2340 21.7130 1.0596 32.5337 6.1236 0.0066 2.7415 0.7432 0.0001 0.0034 0.2371 65.1902 64.3228 0.1960 7.3109 8.8669 17.5105 24.9221 18.7488 28.2141 0.7788 67.6989 98.7895 1.6885 0.7112 2.3298 1.5625 17.5583 5.3264 18.5129 87.2652 238.7149 1.9089 1.7611 6.2661 6.0478 1.9614 0.2903 0.0920 19.9547 5.7940 14.3463 13.1772 11.1483 10.2018 30.5559 2.1396 17.1902 21.7163 3.4341 1.2267
temp: 298.150 k
press: 1.00000 atm
elementType: 35 8 8 8 8 6 6 6 6 6 6 6 6 6 6 6 6 6 6 6 6 6 6 6 6 6 6 6 6 1 1 1 1 1 1 1 1 1 1 1 1 1 1 1 1 1 1 1
symmnumber: 1
zpe: 939957.7 jmol-1
zpe.correction: 0.358011 hartree
zpe.thermalcorrener: 0.381981 hartree
zpe.thermalcorrenthalpy: 0.382925 hartree
zpe.thermalcorrgfe: 0.300066 hartree
zpe.sumelectzpe: -1238.270261 hartree
zpe.sumelectthermal: -1238.246291 hartree
zpe.sumelectthermalent: -1238.245347 hartree
zpe.sumelectthermalfe: -1238.328205 hartree
dipole: 1.7349 -3.9156 0.0079
dipole: 4.2827
quadrupole: -164.4331 -170.0481 -155.6007
quadrupole: 10.4195 -0.1104 0.0647
quadrupole: -1.0725 -6.6875 7.7600 10.4195 -0.1104 0.0647
hfenergy: -1238.6282715 hartree
pointgroup: C01 [X(C24H19Br1O4)]
dipole: -0.5906806 1.5780243 0.0028857 debye
polarizability: 384.9774048|3.0983673|262.819434|0.074423|-0.0873443|225.9939334 unknown
InChI: InChI=1S/C24H19BrO4/c1-16(26)28-21-12-8-18(9-13-21)23(24(25)20-6-4-3-5-7-20)19-10-14-22(15-11-19)29-17(2)27/h3-15H,1-2H3
charge 0 multiplicity 1
48 atoms
Br 1.546319 -3.425809 -0.001154
O  5.547567 1.622244 0.000158
O  -3.826374 3.21882 0.002221
O  6.724278 -0.411208 -0.006801
O  -5.619723 1.701226 -0.001135
C  0.319473 -0.784352 0.000055
C  1.707519 -0.206299 -0.00009
C  -0.81257 0.216995 0.000628
C  0.042678 -2.117059 -0.000115
C  -1.295832 -2.766318 0.000351
C  2.36325 0.091046 1.221698
C  -1.333685 0.715556 -1.220625
C  2.360274 0.097616 -1.22185
C  -1.331375 0.716662 1.222408
C  3.649309 0.671055 1.228009
C  -2.35453 1.689493 -1.226459
C  3.64635 0.677585 -1.228182
C  -2.352276 1.690542 1.229294
C  4.274521 0.957723 -0.00009
C  -2.85028 2.166186 0.001675
C  -1.939528 -3.08471 -1.223957
C  -1.936742 -3.088516 1.225129
C  -3.210484 -3.698499 -1.222183
C  -3.207698 -3.702295 1.224349
C  -3.848771 -4.007368 0.001331
C  6.732287 0.831731 -0.003841
C  -5.208455 2.874224 0.001917
C  7.936554 1.745936 0.000833
C  -6.033659 4.140954 -0.003985
H  1.871513 -0.144324 2.171615
H  -0.941931 0.337164 -2.171007
H  1.866195 -0.132499 -2.171842
H  -0.937777 0.339183 2.17239
H  4.162715 0.898058 2.167335
H  -2.761968 2.076243 -2.165529
H  4.157513 0.909551 -2.167515
H  -2.7580 2.078103 2.16877
H  -1.440378 -2.851506 -2.171096
H  -1.435428 -2.858261 2.171848
H  -3.702729 -3.933046 -2.172286
H  -3.69778 -3.939794 2.174836
H  -4.836579 -4.481056 0.001719
H  7.911721 2.408767 -0.881139
H  8.857668 1.146323 -0.0069
H  7.916841 2.392363 0.89514
H  -5.790663 4.754777 0.880307
H  -7.103105 3.887316 -0.001633
H  -5.793025 4.744777 -0.895907
