program: Gaussian 09
title: 000192813
version: EM64L-G09RevD.01
frameworkgroup: C1[X(C9H13N3O10P2)]
method: RPBEPBE
basis: SDD
operation: Freq
keyword: #p
keyword: freq=noraman
keyword: PBEPBE/SDD
title: #p freq=noraman PBEPBE/SDD
converged: NO YES NO NO
title: Mulliken charges:
elementType: P P O O O O O O O O O O N N N C C C C C C C C C H H H H H H H H H H H H H
charge: 1.350882 1.380662 -0.360560 -0.487302 -0.496122 -0.491039 -0.636990 -0.556086 -0.301376 -0.680327 -0.695303 -0.589758 -0.178955 -0.050123 -0.617764 -0.129887 -0.151936 -0.004773 -0.058453 -0.348909 -0.016039 0.122157 -0.342211 0.202692 0.317554 0.320831 0.283853 0.277686 0.286990 0.242265 0.256726 0.403612 0.239184 0.329384 0.345695 0.434562 0.399176
chargesum: 0.00000
title: Mulliken charges with hydrogens summed into heavy atoms:
elementType: P P O O O O O O O O O O N N N C C C C C C C C C
charge: 1.350882 1.380662 -0.360560 -0.487302 -0.496122 -0.491039 -0.233378 -0.556086 -0.301376 -0.245764 -0.296127 -0.589758 -0.178955 -0.050123 0.057315 0.187667 0.168895 0.279081 0.219233 0.180347 0.240687 0.122157 -0.103027 0.202692
polarizability: 2.63454377e+02 2.85727701e+01 1.70121860e+02 1.15537770e-02 -7.68050483e-01 1.59463115e+02
1716.lowfreq: -7.1414 -4.8365 -0.0020 -0.0018 -0.0018 2.9601 26.2171 33.4481 47.1054
frequency: 26.1097 33.3558 47.1008 53.7602 55.0043 60.6781 93.9528 119.5618 127.7578 149.4416 154.7719 175.5660 186.6410 189.6155 210.5278 219.8659 237.9149 254.0536 275.7316 290.8293 296.3990 315.4686 334.0965 339.5582 343.4657 345.7682 354.9393 362.2659 375.0377 417.8661 440.2301 472.7414 487.6895 518.6703 537.7765 553.4269 567.2612 589.8519 591.7951 610.0314 627.8777 665.0596 681.7124 694.3798 714.5238 725.9185 742.8526 748.2354 751.5923 764.8693 780.0907 782.2826 802.7160 818.9535 863.0019 897.7497 926.5219 941.5449 944.9346 951.4583 978.2585 987.5594 1015.5050 1016.0539 1022.5822 1044.4709 1078.6853 1082.7710 1085.6813 1095.7962 1098.8288 1171.9233 1208.9896 1213.7877 1220.4339 1236.0607 1247.8040 1256.2696 1265.7066 1285.7766 1289.9143 1321.3980 1337.6100 1351.6074 1369.4422 1389.2621 1448.4631 1489.7044 1502.3389 1589.5978 1632.9690 1650.6767 3022.9530 3063.2587 3066.8427 3072.6765 3097.5710 3118.4867 3132.2845 3159.6587 3192.9613 3537.4251 3583.8907 3598.9637 3692.8396
redmass: 9.3169 7.6897 7.7426 8.4404 5.8895 7.4168 8.9283 8.7965 8.5023 6.8849 7.0055 8.0056 5.1245 6.2741 6.1941 7.3357 3.0707 6.0589 4.4691 3.0160 1.8409 7.2117 4.6055 3.7081 2.6504 3.7212 6.8450 5.1729 4.3600 6.5910 3.7812 1.1592 4.5295 5.0101 6.0948 6.7689 9.3487 2.9173 1.7522 6.9234 9.7435 10.0541 9.6651 2.9161 6.4946 7.2273 4.0754 3.0624 4.3654 5.1272 1.8407 4.6534 2.3880 5.5461 3.5321 4.6493 6.0344 1.4430 4.5974 4.4828 3.0795 1.7339 1.9427 1.7341 2.0770 3.4531 4.5589 2.2150 4.2300 2.6005 3.4656 1.9476 1.6523 1.5951 1.9195 1.1695 1.2690 1.2820 1.3887 1.4397 1.4161 1.2948 1.2767 2.0529 1.2595 1.3739 1.0786 4.1067 4.9839 2.7916 1.9256 6.0681 1.0576 1.0814 1.0796 1.0816 1.1063 1.0884 1.0887 1.0911 1.0995 1.0457 1.0663 1.0663 1.1045
irintensity: 0.3867 5.1409 3.4161 0.5892 3.9807 1.1399 6.5210 8.6618 17.7867 9.0748 8.2535 3.5629 11.7630 3.9408 9.4463 6.2236 1.3989 9.6551 20.5426 30.4109 126.2383 48.5009 12.8985 18.9263 41.1714 14.3133 10.3468 2.2972 4.7085 3.3474 14.1475 123.6307 10.6200 17.6638 5.7269 31.4505 8.7069 38.0410 157.8557 20.7034 8.1661 37.5742 147.1474 0.9684 13.7482 29.8948 64.6626 41.3062 299.8927 43.9885 62.6033 207.9277 54.4402 30.2014 178.6490 182.7707 35.7622 4.1712 254.4755 121.9827 28.0579 33.2956 1.6773 7.0115 17.0713 73.1260 164.0248 6.5333 14.1538 134.5512 100.7698 72.0100 30.1583 2.6886 8.7195 15.3948 17.3804 141.3542 110.0365 9.7492 15.7113 5.8766 3.4097 78.9902 30.8654 4.7708 19.8170 251.2775 62.9678 357.0044 76.6196 865.2637 15.9247 217.7545 289.2584 243.2767 0.7482 2.4008 1.5877 0.6705 2.5264 141.9021 103.9187 54.5967 45.3526
temp: 298.150 k
press: 1.00000 atm
elementType: 15 15 8 8 8 8 8 8 8 8 8 8 7 7 7 6 6 6 6 6 6 6 6 6 1 1 1 1 1 1 1 1 1 1 1 1 1
symmnumber: 1
zpe: 657758.3 jmol-1
zpe.correction: 0.250527 hartree
zpe.thermalcorrener: 0.274451 hartree
zpe.thermalcorrenthalpy: 0.275395 hartree
zpe.thermalcorrgfe: 0.196750 hartree
zpe.sumelectzpe: -1947.865410 hartree
zpe.sumelectthermal: -1947.841485 hartree
zpe.sumelectthermalent: -1947.840541 hartree
zpe.sumelectthermalfe: -1947.919187 hartree
dipole: -1.9619 -9.1688 -0.0269
dipole: 9.3764
quadrupole: -134.5791 -166.5059 -157.5781
quadrupole: 30.5710 -4.5473 -16.8701
quadrupole: 18.3086 -13.6182 -4.6904 30.5710 -4.5473 -16.8701
hfenergy: -1948.1159365 hartree
pointgroup: C01 [X(C9H13N3O10P2)]
dipole: 3.6397126 0.5997421 -0.033932 debye
polarizability: 173.3239735|32.8730056|256.1749929|5.7502041|19.6525367|163.5403861 unknown
InChI: InChI=1S/C9H13N3O10P2/c10-5-1-2-12(9(13)11-5)8-7-6(21-24(17,18)22-7)4(20-8)3-19-23(14,15)16/h1-2,4,6-8,14-15,17H,3,10H2
charge 0 multiplicity 1
37 atoms
P  -0.400243 -4.050719 -0.968551
P  -2.652356 2.479468 0.627727
O  -1.065805 -0.115751 -0.656745
O  -1.138896 -3.384515 0.466129
O  0.702329 -2.712441 -1.192084
O  -3.122835 0.917422 1.264144
O  0.582303 -5.30291 -0.329285
O  -1.294979 -4.483004 -2.196491
O  0.950577 0.006586 1.959724
O  -2.282122 2.197423 -0.997833
O  -1.04884 2.710113 1.272499
O  -3.700765 3.61418 0.934545
N  1.174076 0.782405 -0.23534
N  2.094507 2.026481 1.635987
N  3.162283 4.054751 1.288867
C  -0.638435 -2.027868 0.784609
C  0.634045 -1.71877 -0.089774
C  -1.694397 -0.953107 0.41996
C  0.390847 -0.348614 -0.757629
C  -2.115888 -0.101213 1.628484
C  1.560827 1.789748 -1.108121
C  1.399883 0.922827 1.20205
C  2.225675 2.906122 -0.658804
C  2.487238 2.982839 0.764512
H  -0.37849 -2.026284 1.85034
H  1.565585 -1.773472 0.487767
H  -2.577735 -1.419464 -0.04826
H  0.613126 -0.435649 -1.834149
H  -1.235899 0.357652 2.110408
H  -2.639229 -0.754159 2.349292
H  1.307895 1.650893 -2.163315
H  0.491253 -6.166957 -0.808532
H  2.523896 3.693917 -1.352437
H  3.485135 4.824974 0.709092
H  3.330335 4.068905 2.294277
H  -1.81871 1.29709 -1.118179
H  -1.006289 3.21981 2.120815
