program: Gaussian 09
title: 000192810
version: EM64L-G09RevD.01
frameworkgroup: C1[X(C15H16N4O)]
method: RPBEPBE
basis: SDD
operation: Freq
keyword: #p
keyword: freq=noraman
keyword: PBEPBE/SDD
title: #p freq=noraman PBEPBE/SDD
converged: YES YES NO NO
title: Mulliken charges:
elementType: O N N N N C C C C C C C C C C C C C C C H H H H H H H H H H H H H H H H
charge: -0.246387 -0.134596 -0.258722 -0.095627 -0.037390 -0.108722 0.227984 0.002654 -0.666884 -0.658604 -0.274219 0.040202 -0.011872 -0.628901 0.469310 -0.378511 -0.427545 -0.224544 -0.226229 -0.248505 0.193222 0.339555 0.220207 0.279143 0.219440 0.219078 0.221471 0.276569 0.299385 0.209654 0.239228 0.276250 0.227704 0.223533 0.219379 0.223290
chargesum: 0.00000
title: Mulliken charges with hydrogens summed into heavy atoms:
elementType: O N N N N C C C C C C C C C C C C C C C
charge: -0.246387 -0.134596 0.080834 -0.095627 -0.037390 0.084500 0.227984 0.002654 0.051905 0.058514 0.025166 0.040202 -0.011872 -0.180019 0.469310 -0.102261 -0.199841 -0.001011 -0.006849 -0.025215
polarizability: 2.22496295e+02 -3.05965089e+00 2.18462657e+02 6.69259138e-03 -9.73136726e+00 1.36722733e+02
1716.lowfreq: -8.8881 -6.8459 -0.0011 -0.0006 -0.0002 3.3820 14.1167 24.5550 28.5219
frequency: 11.7643 24.3332 28.4446 42.7142 70.7118 100.5795 125.3241 167.6155 208.9656 216.2953 221.1819 243.4233 257.8368 277.8019 296.0895 333.0140 352.3944 353.0271 404.5288 409.5229 445.2767 467.3188 483.3659 504.0136 534.8155 567.5196 592.4437 617.8781 635.4792 678.2135 681.3751 700.6150 714.6351 755.3899 786.4246 813.7980 828.6243 855.7887 856.3908 882.0049 914.4394 927.5348 929.0718 945.0504 946.8655 978.1137 989.4341 996.0998 1000.9734 1025.8438 1038.1365 1076.5008 1087.1256 1120.8589 1141.2817 1151.8034 1169.5882 1174.0096 1187.0553 1199.8814 1207.5006 1239.0683 1279.1022 1287.1073 1289.6810 1321.3974 1337.4173 1345.8270 1377.5369 1383.1002 1384.8978 1400.7289 1416.8082 1439.5990 1453.8131 1457.7814 1460.0285 1475.2977 1478.7173 1481.3051 1496.9159 1511.5838 1570.0386 1586.7794 1592.2134 1611.3111 2981.4459 2992.6950 2996.0099 3022.1878 3088.2620 3091.6770 3097.0120 3104.3693 3111.3414 3115.0192 3122.9251 3134.3749 3144.0134 3159.4161 3241.9176 3611.1448
redmass: 4.6458 3.4664 3.8341 6.0206 3.3358 6.4400 3.5238 6.4909 4.9119 3.4780 1.2143 3.9534 1.3241 3.0880 8.8104 3.2743 1.4438 1.7254 2.8404 3.9005 3.6219 3.4975 3.8623 5.7081 5.3178 2.8506 5.1039 6.3543 5.5305 10.2524 4.5561 3.2026 2.1129 2.3064 4.3738 5.4583 3.9651 1.6559 1.2526 2.6943 1.5731 5.2548 1.1671 1.4715 2.1125 1.3787 5.6435 1.3455 2.9380 2.2543 2.7029 2.2829 2.2700 1.5886 2.1902 1.5441 1.0714 1.7475 1.1275 2.8031 2.4560 3.0701 2.3231 1.4992 1.4523 2.2189 1.9037 2.0496 6.3075 1.1980 5.6720 1.2272 4.4779 2.1117 1.1674 1.0602 2.0298 1.0928 1.0567 2.1552 1.1004 5.2411 8.0292 9.7594 6.0989 6.0542 1.0835 1.0353 1.0367 1.0583 1.1036 1.1007 1.1002 1.1017 1.1010 1.0846 1.0874 1.0924 1.0965 1.1016 1.1004 1.0830
irintensity: 2.7272 1.2069 1.0171 0.7489 2.2665 6.3339 0.6985 0.7219 1.2823 0.6900 0.2406 1.8898 0.5746 2.0349 16.2603 3.5934 67.6304 23.7739 0.1862 15.0696 1.3028 2.3608 1.4630 4.3188 4.1725 13.5926 12.6392 1.9391 2.1505 4.5538 7.7902 10.0495 62.6925 37.3825 21.8221 2.6354 5.9987 11.9375 0.6827 3.0253 9.7282 12.4848 5.4256 0.0037 2.3305 0.6430 0.0959 1.3559 38.7427 12.7950 11.0586 43.0014 16.5244 11.9977 12.8925 163.6301 3.2620 3.9355 5.5844 2.6684 62.7706 91.4205 18.7707 15.6951 2.8909 65.5746 106.1260 118.8174 34.2500 26.9898 19.5252 47.0053 186.7391 7.7414 22.3200 1.4613 4.9648 54.2746 6.5122 26.7217 17.6988 46.3806 368.5585 404.7903 2.0698 6.8768 29.7425 21.0664 30.6752 19.0838 7.8352 16.2245 36.7902 4.4586 12.6228 3.3623 2.4013 23.2494 32.2458 29.5442 5.9676 163.6249
temp: 298.150 k
press: 1.00000 atm
elementType: 8 7 7 7 7 6 6 6 6 6 6 6 6 6 6 6 6 6 6 6 1 1 1 1 1 1 1 1 1 1 1 1 1 1 1 1
symmnumber: 1
zpe: 750333.6 jmol-1
zpe.correction: 0.285787 hartree
zpe.thermalcorrener: 0.303762 hartree
zpe.thermalcorrenthalpy: 0.304706 hartree
zpe.thermalcorrgfe: 0.236963 hartree
zpe.sumelectzpe: -873.964124 hartree
zpe.sumelectthermal: -873.946149 hartree
zpe.sumelectthermalent: -873.945205 hartree
zpe.sumelectthermalfe: -874.012948 hartree
dipole: -8.0180 -7.9269 -2.5455
dipole: 11.5587
quadrupole: -82.7842 -134.0050 -113.4354
quadrupole: 6.3924 6.2985 -2.1012
quadrupole: 27.2907 -23.9301 -3.3605 6.3924 6.2985 -2.1012
hfenergy: -874.2499111 hartree
pointgroup: C01 [X(C15H16N4O1)]
dipole: -3.131181 -3.1504992 -0.9747881 debye
polarizability: 222.5468825|-3.0534214|218.2981404|-0.1331988|-10.188579|136.8366627 unknown
InChI: InChI=1S/C15H16N4O/c1-10(2)19-14-12(9-16-19)15(20)18-13(17-14)8-11-6-4-3-5-7-11/h3-7,9-10,16H,8H2,1-2H3
charge 0 multiplicity 1
36 atoms
O  -1.149887 3.670742 -0.214796
N  -2.770024 -0.749436 -0.226581
N  -3.679564 0.095381 -0.882082
N  -0.583436 -0.392578 0.802861
N  0.175006 1.966593 0.758162
C  -2.923421 -2.232445 -0.198097
C  -1.693931 0.039037 0.173008
C  -1.97937 1.40051 -0.219311
C  -2.858834 -2.733368 1.26143
C  -1.855718 -2.892089 -1.100289
C  -3.218705 1.392641 -0.863515
C  0.311867 0.657111 1.053873
C  -0.982481 2.449794 0.090742
C  1.614875 0.234936 1.714901
C  2.677543 -0.138286 0.677573
C  3.170907 0.843286 -0.221595
C  3.185116 -1.458557 0.596408
C  4.157079 0.509166 -1.175559
C  4.173723 -1.794461 -0.35829
C  4.663915 -0.810665 -1.247169
H  -3.932584 -2.440168 -0.610172
H  -4.57012 -0.27501 -1.207947
H  -2.982972 -3.830366 1.280109
H  -1.880097 -2.476607 1.699131
H  -3.653652 -2.278702 1.878075
H  -1.92972 -2.533645 -2.142121
H  -1.992696 -3.987767 -1.096879
H  -0.847404 -2.660953 -0.717686
H  -3.790989 2.208305 -1.298862
H  1.415183 -0.62594 2.375015
H  1.967892 1.085305 2.323495
H  2.76714 1.861263 -0.167694
H  2.80664 -2.224178 1.284765
H  4.531759 1.277511 -1.861821
H  4.561144 -2.819048 -0.405781
H  5.432115 -1.067812 -1.985603
