program: Gaussian 09
title: 000192809
version: EM64L-G09RevD.01
frameworkgroup: C1[X(C7H7NO4S)]
method: RPBEPBE
basis: SDD
operation: Freq
keyword: #p
keyword: freq=noraman
keyword: PBEPBE/SDD
title: #p freq=noraman PBEPBE/SDD
converged: NO YES NO NO
title: Mulliken charges:
elementType: S O O O O N C C C C C C C H H H H H H H
charge: 0.947670 -0.257098 -0.254510 -0.539671 -0.538790 -0.717297 -0.027667 0.242862 0.186411 -0.346777 -0.212501 -0.305189 -0.201502 0.308124 0.286277 0.265855 0.246282 0.246316 0.335186 0.336019
chargesum: 0.00000
title: Mulliken charges with hydrogens summed into heavy atoms:
elementType: S O O O O N C C C C C C C
charge: 0.947670 -0.257098 -0.254510 -0.539671 -0.538790 -0.046092 -0.027667 0.242862 0.186411 -0.038653 0.073776 -0.039335 0.291096
polarizability: 1.71137478e+02 -4.66362052e+00 1.17211896e+02 -2.39691647e+00 -8.30204080e-02 7.15568145e+01
1716.lowfreq: -12.9695 -6.5462 0.0012 0.0019 0.0021 9.2778 10.8930 29.2823 86.7996
frequency: -8.5092 29.2581 86.7937 111.1150 127.4620 181.7849 221.6498 231.0947 265.3775 293.1978 310.2732 356.3553 411.8612 425.0050 438.9325 473.5797 557.4113 590.3868 646.2663 682.3422 726.5639 773.3901 793.4349 797.2638 823.2585 831.7961 850.6638 883.6211 906.9961 945.5848 973.9310 1035.9488 1063.4627 1071.4017 1079.6787 1120.4214 1136.2170 1227.4936 1252.5228 1364.8904 1408.4013 1419.9701 1462.4941 1485.3950 1534.6763 1600.1480 1622.0173 3023.5308 3105.5257 3165.7032 3183.3560 3192.1496 3363.7739 3531.4526
redmass: 2.3168 5.2461 6.7661 1.5004 7.9184 6.9123 7.4219 8.6279 2.8142 10.5556 5.4720 7.1031 9.2611 3.0851 5.7841 4.0198 6.6586 4.8049 7.4237 9.6474 4.4677 6.2675 2.7222 3.3083 1.3709 5.9792 8.3764 1.4146 4.0751 1.3459 6.6080 1.9991 1.4560 1.7770 2.8968 1.0368 1.3487 2.2658 1.7085 1.3004 4.6270 3.4721 3.1026 1.2408 1.0852 7.8252 8.8969 1.0537 1.1192 1.0901 1.0938 1.0964 1.0414 1.1001
irintensity: 13.7158 1.1364 2.1902 39.7638 0.5069 2.9352 4.0216 1.9305 6.4332 2.6544 0.7924 1.8955 83.7580 3.8121 16.1299 174.2615 3.6116 30.0551 5.4796 0.4083 1.3761 9.8332 28.2261 152.9027 36.5231 102.6272 18.4375 28.3873 60.6905 0.2067 121.0232 39.1446 4.5173 34.9295 1.8725 0.0172 8.5242 154.8610 108.9331 3.4111 41.2757 11.7818 185.2291 19.2132 22.4242 6.9559 0.3978 104.9281 25.4368 2.3659 9.0740 4.6382 27.5705 25.1887
temp: 298.150 k
press: 1.00000 atm
elementType: 16 8 8 8 8 7 6 6 6 6 6 6 6 1 1 1 1 1 1 1
symmnumber: 1
zpe: 354078.4 jmol-1
zpe.correction: 0.134861 hartree
zpe.thermalcorrener: 0.146709 hartree
zpe.thermalcorrenthalpy: 0.147653 hartree
zpe.thermalcorrgfe: 0.096059 hartree
zpe.sumelectzpe: -1023.480280 hartree
zpe.sumelectthermal: -1023.468432 hartree
zpe.sumelectthermalent: -1023.467488 hartree
zpe.sumelectthermalfe: -1023.519082 hartree
dipole: 3.7407 0.4647 2.9184
dipole: 4.7672
quadrupole: -73.5637 -83.9827 -85.6941
quadrupole: -2.0229 -13.0597 -1.6145
quadrupole: 7.5165 -2.9025 -4.6139 -2.0229 -13.0597 -1.6145
hfenergy: -1023.615141 hartree
pointgroup: C01 [X(C7H7N1O4S1)]
dipole: 1.5009238 0.2046072 1.1059355 debye
dipolederiv: 2.2538297 0.1557075 -0.2623648 0.2131952 1.2116333 -0.0515581 -0.2636443 -0.0444052 1.5902627 -1.3027636 0.3065007 0.0176141 0.4453263 -0.5526403 -0.0065108 -0.002371 0.0003733 -0.2464599 -1.5100296 0.1935787 0.0155149 0.1852514 -0.442564 -0.0048421 -0.0056758 -0.0014849 -0.2481728 -0.7980158 0.0451196 -0.015939 0.0679552 -0.5832781 0.1764252 0.040496 0.0077344 -0.5484419 -0.7357835 -0.0749336 0.0483657 -0.1207787 -0.638456 -0.1693774 0.0418263 0.0068034 -0.5483739 -0.7281668 -0.0585748 0.0820551 -0.0764091 -0.3737543 0.0198318 0.1731046 0.0300251 -0.9003976 -0.2762839 -0.0818052 -0.035646 0.0542122 -0.0826453 -0.0085434 -0.1424546 -0.0214299 -0.1790999 0.6137538 -0.4476202 -0.0057859 -0.964553 0.3686307 0.0136444 0.0151191 0.0044738 0.0589923 1.3359281 -0.131074 -0.0046775 0.3318464 -0.0627573 -0.0084064 0.0062497 -0.0036996 0.0573834 -0.1447232 0.1881442 0.0160999 -0.258623 -0.0602099 0.0050065 0.0160644 0.0221763 -0.1033948 -0.1758955 -0.0085159 0.0185937 0.171947 -0.0439321 0.002494 0.0146724 -0.024919 -0.111069 -0.1844766 0.0251079 0.0017134 0.0909318 0.084187 -0.0007289 0.0110798 -0.0003466 -0.1454993 1.1759478 -0.1857411 -0.019235 -0.2395328 0.5822405 0.0055266 -0.0142885 0.0036297 0.5640713 0.1648797 -0.0352428 -0.0085561 0.0025809 0.0844885 0.0021065 -0.0017344 -0.0081397 0.1743047 0.0975503 0.0706532 -0.0067551 0.0367931 0.0951217 -0.0044148 -0.0036016 0.0093255 0.1623828 0.0465209 -0.0518006 -0.0003461 -0.0519513 0.0015871 0.0025324 -0.0020256 0.0020385 0.1830392 -0.0773492 0.0419753 0.0571087 0.0522711 0.0558148 -0.0179935 0.1547362 -0.0472609 -0.0645631 -0.0808819 0.0443588 -0.0545216 0.0537891 0.0570716 0.0187512 -0.1457338 0.0462019 -0.0515859 0.1487345 0.0686568 0.0623489 0.025671 0.1647819 0.1093549 0.0434973 0.0614268 0.179707 0.1772248 -0.0644944 0.0944128 -0.0199227 0.1346802 -0.083298 0.0646839 -0.0425229 0.1769145 unknown
polarizability: 170.9413454|-4.8038645|117.2009295|-4.8590901|-0.8969863|71.7639141 unknown
InChI: InChI=1S/C7H7NO4S/c8-13(9,10)5-1-2-6-7(3-5)12-4-11-6/h1-3H,4,8H2
charge 0 multiplicity 1
20 atoms
S  -2.678114 -0.185226 -0.053225
O  2.476111 -1.536298 -0.00116
O  3.25148 0.738172 0.008758
O  -3.420202 1.139595 -0.644893
O  -2.885883 -1.685457 -0.655863
N  -3.138279 -0.283843 1.727926
C  -0.837383 0.160705 -0.017552
C  1.385322 -0.640371 -0.005062
C  1.843096 0.699558 0.000348
C  0.027805 -0.958557 -0.014489
C  -0.421903 1.501391 -0.022036
C  0.969417 1.790529 -0.013859
C  3.697486 -0.684682 -0.014951
H  -0.351322 -1.982834 -0.047002
H  -1.163797 2.30439 -0.059345
H  1.339673 2.817878 -0.021871
H  4.255161 -0.869342 -0.948638
H  4.289237 -0.889422 0.892506
H  -3.816002 0.472025 1.923682
H  -3.519405 -1.22861 1.90453
