program: Gaussian 09
title: 000192801
version: EM64L-G09RevD.01
frameworkgroup: C1[X(C2H5N3)]
method: RPBEPBE
basis: SDD
operation: Freq
keyword: #p
keyword: freq=noraman
keyword: PBEPBE/SDD
title: #p freq=noraman PBEPBE/SDD
converged: NO YES NO NO
title: Mulliken charges:
elementType: N N N C C H H H H H
charge: -0.288827 -0.342379 -0.080918 -0.449851 -0.174010 0.242277 0.233168 0.290675 0.311862 0.258003
chargesum: 0.00000
title: Mulliken charges with hydrogens summed into heavy atoms:
elementType: N N N C C
charge: 0.001847 -0.030517 -0.080918 0.025595 0.083993
polarizability: 4.87098814e+01 -2.84738772e+00 4.26606342e+01 -1.35503389e+00 -5.73590938e-01 2.69899209e+01
1716.lowfreq: 0.0011 0.0011 0.0012 14.2746 21.2472 25.6238 215.9974 462.5800 568.4671
frequency: 215.9956 462.5794 568.4657 726.2048 766.3725 847.5078 879.0186 908.8063 961.0859 979.5109 1081.4809 1100.8415 1201.2000 1271.6099 1301.2890 1322.2383 1427.1025 1481.5025 1563.6731 2991.3915 3065.8506 3192.2611 3370.8136 3484.5305
redmass: 2.2973 1.7593 2.1024 4.2455 3.0458 3.7377 2.1071 2.5294 1.6356 4.1438 2.3858 1.4609 1.2458 1.3401 1.2388 1.3563 1.0741 1.1006 5.5737 1.0636 1.1036 1.0970 1.0767 1.0786
irintensity: 14.1537 93.5791 170.3067 9.9848 119.0067 6.0001 10.8515 7.2072 38.8614 16.6337 18.4593 22.4005 14.5592 4.8608 14.7700 34.0497 12.3194 2.9245 64.2468 68.4830 26.1023 6.5366 1.5356 9.4923
temp: 298.150 k
press: 1.00000 atm
elementType: 7 7 7 6 6 1 1 1 1 1
symmnumber: 1
zpe: 210371.3 jmol-1
zpe.correction: 0.080126 hartree
zpe.thermalcorrener: 0.084495 hartree
zpe.thermalcorrenthalpy: 0.085439 hartree
zpe.thermalcorrgfe: 0.053129 hartree
zpe.sumelectzpe: -243.006429 hartree
zpe.sumelectthermal: -243.002060 hartree
zpe.sumelectthermalent: -243.001116 hartree
zpe.sumelectthermalfe: -243.033426 hartree
dipole: -0.8628 1.6385 0.0266
dipole: 1.8519
quadrupole: -24.2840 -35.7464 -29.3196
quadrupole: 0.0554 -3.1893 -1.3140
quadrupole: 5.4993 -5.9630 0.4637 0.0554 -3.1893 -1.3140
hfenergy: -243.0865551 hartree
pointgroup: C01 [X(C2H5N3)]
dipole: -0.6219758 -0.3772535 -0.0411497 debye
dipolederiv: -0.5747016 0.0016132 -0.0034137 -0.0067465 -0.1751962 -0.0360392 0.1827208 -0.0855809 -0.0298826 -0.806849 -0.3950341 -0.1813521 -0.1795416 -0.2994365 -0.1727597 -0.3280245 -0.3205461 -0.1971594 -0.5640186 -0.1487789 -0.0254267 -0.2206837 -0.5857424 -0.0436475 0.0699183 0.0155656 -0.3602348 0.3322499 0.0307108 0.0449676 0.0539074 0.4372285 0.0893542 0.0488535 0.1127097 0.4165223 0.9292501 0.3649445 0.1170798 0.2886186 0.4295503 0.0671171 0.0073121 0.0763781 -0.0470766 0.0458862 0.0345369 -0.0129798 -0.0340498 -0.0213117 -0.0939644 -0.0323917 -0.1613114 -0.127033 0.0710774 0.0154468 0.0063931 -0.041643 -0.0600351 0.0790521 -0.0060621 0.147178 -0.0143459 0.2804643 -0.0313411 0.0139897 -0.0141368 0.1188444 0.0084871 -0.1148867 0.030709 -0.0378298 0.2147823 0.0631233 0.0423983 0.0920988 0.1908848 0.0965248 0.2005471 0.1927275 0.2335317 0.0718591 0.0647786 -0.0016563 0.0621764 -0.0347862 0.0058754 -0.0279869 -0.0078296 0.163508 unknown
polarizability: 42.1304999|2.5681166|49.0270166|1.9105112|-1.1105812|27.20292 unknown
InChI: InChI=1S/C2H5N3/c1-3-2-5-4-1/h1,4-5H,2H2
charge 0 multiplicity 1
10 atoms
N  -1.226951 0.444356 -0.193693
N  -0.814537 -0.977062 -0.154823
N  1.195892 0.184445 -0.064127
C  0.080155 1.192421 0.032966
C  0.600937 -0.984872 -0.079554
H  0.112211 1.643599 1.04292
H  0.194018 1.990538 -0.720504
H  -1.555452 0.604102 -1.161354
H  -1.364355 -1.550632 0.494979
H  1.137182 -1.936092 -0.070011
