program: Gaussian 09
title: 000192793
version: EM64L-G09RevD.01
frameworkgroup: C1[X(C22H30O3)]
method: RPBEPBE
basis: SDD
operation: Freq
keyword: #pfreq=noraman
keyword: PBEPBE/SDD
title: #p freq=noraman PBEPBE/SDD
converged: NO YES NO NO
title: Mulliken charges:
elementType: O O O C C C C C C C C C C C C C C C C C C C C C C H H H H H H H H H H H H H H H H H H H H H H H H H H H H H H
charge: -0.277645 -0.213259 -0.233998 0.397550 -0.074814 -0.210518 -0.151708 -0.238356 -0.520481 -0.549187 -0.525292 0.193988 -0.477759 -0.834230 -0.390783 0.408661 -0.485898 -0.805559 0.164321 0.137352 -0.556369 -0.532117 0.167995 -0.800957 -0.535621 0.241025 0.213405 0.220698 0.235374 0.206236 0.210353 0.211230 0.227549 0.220048 0.218690 0.263313 0.212941 0.226640 0.224485 0.252148 0.238613 0.207374 0.220888 0.230248 0.237036 0.221906 0.231823 0.246639 0.292058 0.242756 0.247544 0.255504 0.221270 0.218201 0.248687
chargesum: 0.00000
title: Mulliken charges with hydrogens summed into heavy atoms:
elementType: O O O C C C C C C C C C C C C C C C C C C C C C C
charge: -0.277645 -0.213259 -0.233998 0.397550 0.166210 0.002887 0.068991 -0.002982 -0.103892 -0.110408 -0.086554 0.193988 -0.001505 -0.130956 -0.152171 0.408661 -0.057635 -0.116370 0.164321 0.137352 -0.077907 -0.240059 0.167995 -0.055153 0.152537
polarizability: 3.39242712e+02 -1.87319492e+01 2.40971954e+02 -9.45089550e+00 3.67418892e+00 1.71390454e+02
1716.lowfreq: -0.0001 0.0004 0.0006 4.1057 6.4292 12.2731 30.7147 42.8053 48.6263
frequency: 30.6457 42.7952 48.5861 64.2234 84.1783 91.8175 113.9622 118.2648 133.2284 155.8234 168.3008 180.2720 191.0707 199.8309 213.7859 228.5285 241.5861 244.7691 257.5488 269.8033 276.0214 292.1747 302.1447 327.9064 339.8541 359.9935 374.1433 384.2139 389.6654 438.0551 444.4692 452.0911 466.3489 483.9217 504.6020 529.2624 541.1354 579.2581 580.9697 586.9316 634.2226 637.2161 646.4278 684.3341 706.8051 713.9308 737.3678 772.0030 795.9372 820.1693 830.4044 836.3894 855.7778 866.4445 896.5924 909.7866 918.0321 920.4734 934.8441 939.8943 952.2764 958.1279 960.9980 975.9195 987.3477 1011.8772 1025.4718 1033.8184 1040.9905 1049.5444 1058.5808 1083.9735 1090.4809 1094.0321 1107.7446 1114.0510 1122.7970 1132.2523 1141.2070 1149.4228 1166.7545 1168.8947 1182.8844 1190.3140 1193.0704 1202.2266 1215.7938 1228.0651 1235.1586 1240.2056 1245.3649 1269.0012 1277.6752 1283.9855 1293.8354 1299.4344 1308.4669 1317.1047 1321.1205 1326.4041 1332.8327 1335.4457 1346.9771 1350.4186 1358.7208 1365.3004 1366.7544 1377.3431 1389.4235 1402.6554 1435.7645 1442.9497 1443.5679 1451.6888 1457.7768 1463.5454 1465.7953 1466.9664 1475.0584 1475.2026 1478.3427 1480.8913 1490.7562 1491.3782 1493.9919 1567.8459 1598.2024 1622.3309 1626.2321 2921.7002 2948.7241 2955.8202 2967.3892 2970.6857 2977.4047 2978.3197 2982.1390 2982.8873 2990.0742 2990.6113 2993.3603 2995.0057 3013.4003 3024.9848 3041.1723 3041.5903 3049.9287 3051.3234 3059.2481 3062.3057 3074.4607 3078.3102 3079.6677 3094.6557 3096.9539 3119.2911 3124.9167 3136.7018 3162.2198
redmass: 5.9234 3.5983 4.1006 4.4341 3.5565 3.9374 2.3551 1.1330 3.1717 4.4229 4.0911 2.6790 2.1679 1.7545 2.3294 1.7329 1.6162 1.8610 2.9875 2.7928 1.7729 2.1585 2.4174 2.7003 3.3244 2.8409 2.3894 4.6223 3.0552 3.9248 3.2480 3.4111 3.7701 3.1818 2.9321 3.8222 2.8891 3.6020 3.1686 3.2302 2.7949 3.7286 4.1557 3.1080 3.4530 2.7525 3.5254 2.2838 2.0197 2.7923 1.7293 1.9476 2.2512 2.4527 2.3319 1.7639 2.3183 2.2769 1.7078 2.6881 2.0492 2.2106 1.7712 1.9335 2.1844 2.0094 2.0113 1.8916 2.2117 3.3403 2.9088 2.3452 1.7184 3.0013 1.7313 1.2671 1.8280 2.4029 2.0435 1.5433 1.6896 1.6264 2.2421 2.3996 1.8893 1.7351 1.2448 1.5701 1.3320 1.5941 1.7331 1.4448 1.8951 1.4464 1.4477 1.8099 1.3175 1.4545 1.8123 1.5919 1.3236 1.5932 1.4630 1.3787 1.4310 1.3235 1.2549 1.6235 1.6148 1.1990 1.1774 1.0738 1.0780 1.0605 1.0683 1.0759 1.0503 1.0775 1.0583 1.0666 1.0672 1.0731 1.0655 1.0730 1.0626 10.0077 7.4851 7.3003 7.7976 1.0798 1.0823 1.0331 1.0623 1.0774 1.0628 1.0407 1.0637 1.0717 1.0453 1.0472 1.0625 1.0595 1.0632 1.0961 1.0995 1.1034 1.0956 1.0992 1.0960 1.0943 1.0979 1.1031 1.0983 1.0982 1.0989 1.1006 1.0990 1.0892 1.0908
irintensity: 4.6221 2.7566 1.8466 1.1340 4.6965 0.6901 0.2810 0.6407 0.4981 6.1022 1.2316 0.7812 0.7299 0.5627 0.6757 0.2714 0.7849 3.3507 0.9772 0.6875 1.5533 4.0793 0.7479 0.4275 0.1045 0.8393 0.7818 9.4417 3.8368 5.0322 1.4323 0.9611 0.4295 1.8859 1.4180 1.5779 1.5830 14.2787 0.1164 0.5625 0.6199 6.0205 6.3031 7.2557 5.9456 9.7766 0.9293 5.4451 6.5518 4.1055 6.1769 15.6918 7.5219 7.5951 0.8590 4.3362 3.5887 8.2603 5.6151 5.7753 3.7064 11.4277 5.6106 8.9709 0.5908 9.5464 0.9167 22.3325 5.0507 26.1921 18.1986 7.0655 2.6312 3.1556 0.5520 0.1915 28.6537 2.5881 21.7059 5.5071 2.5628 81.9509 8.9866 84.3800 35.3397 53.9578 9.0732 50.4381 14.7181 18.2523 22.2829 7.6251 38.5626 8.6431 7.7508 24.6978 1.5357 3.0325 29.4456 11.4729 5.4890 26.5232 9.0657 14.3935 9.2809 0.4040 63.5395 12.7701 19.9922 32.5535 3.4203 15.0306 17.7133 7.7485 15.4777 4.3488 14.6398 14.3732 10.3020 17.9181 6.9606 14.2924 7.5959 14.6794 5.7793 139.0313 299.1442 112.5488 48.5894 16.2608 23.9409 51.0877 24.3698 21.0496 18.6515 6.3750 16.9937 12.5935 7.3655 0.8321 82.6878 28.9998 34.5082 63.6425 18.9876 48.0178 45.3437 25.3857 21.8191 9.3862 31.5999 39.3571 28.4418 18.7670 22.3282 17.4256 24.6952 12.9710 0.3075
temp: 298.150 k
press: 1.00000 atm
elementType: 8 8 8 6 6 6 6 6 6 6 6 6 6 6 6 6 6 6 6 6 6 6 6 6 6 1 1 1 1 1 1 1 1 1 1 1 1 1 1 1 1 1 1 1 1 1 1 1 1 1 1 1 1 1 1
symmnumber: 1
zpe: 1237329.4 jmol-1
zpe.correction: 0.471274 hartree
zpe.thermalcorrener: 0.495577 hartree
zpe.thermalcorrenthalpy: 0.496521 hartree
zpe.thermalcorrgfe: 0.418966 hartree
zpe.sumelectzpe: -1080.073207 hartree
zpe.sumelectthermal: -1080.048904 hartree
zpe.sumelectthermalent: -1080.047960 hartree
zpe.sumelectthermalfe: -1080.125514 hartree
dipole: -3.6843 0.6917 -0.5594
dipole: 3.7902
quadrupole: -218.0736 -133.2352 -147.3638
quadrupole: 17.9312 9.6000 0.9304
quadrupole: -51.8494 32.9890 18.8604 17.9312 9.6000 0.9304
hfenergy: -1080.5444809 hartree
pointgroup: C01 [X(C22H30O3)]
dipole: 1.4414076 0.3224276 0.2048396 debye
polarizability: 338.1640206|20.8783207|241.4760028|-10.3139487|-7.5191504|171.9650966 unknown
InChI: InChI=1S/C22H30O3/c1-13(23)16-5-6-17-15-12-20(25-4)19-11-14(24)7-9-22(19,3)18(15)8-10-21(16,17)2/h11-12,15-18H,5-10H2,1-4H3
charge 0 multiplicity 1
55 atoms
O  -3.204441 2.463753 0.042124
O  5.795599 0.246413 -0.225644
O  -5.907574 -1.621518 0.350527
C  2.460535 -0.236026 -0.364382
C  1.344309 0.783864 0.038007
C  0.108142 0.730188 -0.899488
C  -0.517693 -0.703962 -1.005935
C  3.546409 0.148949 0.727721
C  1.856401 -1.653861 -0.246585
C  2.097486 2.125986 0.189517
C  0.59073 -1.800437 -1.142086
C  -1.658777 -1.006512 0.047488
C  3.484498 1.711516 0.786528
C  3.034311 0.006187 -1.785993
C  -0.917767 1.783897 -0.550034
C  -2.712182 0.115997 -0.048046
C  -2.339405 -2.362933 -0.325009
C  -1.166251 -1.068498 1.526702
C  4.946598 -0.402165 0.44648
C  -2.212091 1.494432 -0.204176
C  -3.673333 -2.617012 0.408721
C  -4.065241 -0.116662 0.063508
C  -4.649994 -1.450798 0.268233
C  5.279151 -1.77607 1.017149
C  -2.841753 3.867101 -0.151973
H  1.010446 0.485314 1.052288
H  0.485815 0.988321 -1.914611
H  -1.064769 -0.710071 -1.974194
H  3.195211 -0.285731 1.686591
H  1.608684 -1.855486 0.814764
H  2.58682 -2.426661 -0.560221
H  1.561347 2.834729 0.844662
H  2.223001 2.618788 -0.794064
H  0.929422 -1.797081 -2.196525
H  0.153848 -2.802807 -0.982035
H  4.323628 2.13226 0.206176
H  3.598863 2.060515 1.828232
H  3.766412 -0.780708 -2.044215
H  2.248606 -0.009642 -2.560691
H  3.56505 0.970208 -1.858396
H  -0.587657 2.825765 -0.630292
H  -1.649631 -3.198691 -0.105139
H  -2.525228 -2.374617 -1.418131
H  -0.775675 -0.095701 1.867967
H  -1.999159 -1.335866 2.20053
H  -0.375701 -1.830148 1.646704
H  -3.499937 -2.778139 1.492236
H  -4.166817 -3.532681 0.03699
H  -4.767932 0.72097 0.011298
H  5.392816 -1.698465 2.116686
H  4.461386 -2.49618 0.832444
H  6.221304 -2.153157 0.589507
H  -2.506975 4.054935 -1.191283
H  -2.045832 4.17812 0.553355
H  -3.761916 4.433076 0.054317
