program: Gaussian 09
title: 000192778
version: EM64L-G09RevD.01
frameworkgroup: C1[X(C11H15N4O2P)]
method: RPBEPBE
basis: SDD
operation: Freq
keyword: #p
keyword: freq=noraman
keyword: PBEPBE/SDD
title: #p freq=noraman PBEPBE/SDD
converged: YES YES NO NO
title: Mulliken charges:
elementType: P O O N N N N C C C C C C C C C C C H H H H H H H H H H H H H H H
charge: 1.295409 -0.577453 -0.296116 -0.480410 -0.424021 -0.813238 -0.471869 -0.420417 -0.366412 -0.388477 -0.387371 0.359623 0.477233 -0.444929 -0.341562 -0.196721 -0.212547 -0.255855 0.246620 0.285108 0.262926 0.246348 0.242975 0.293599 0.261743 0.245971 0.352757 0.300810 0.217189 0.305460 0.226823 0.227079 0.229725
chargesum: 0.00000
title: Mulliken charges with hydrogens summed into heavy atoms:
elementType: P O O N N N N C C C C C C C C C C C
charge: 1.295409 -0.577453 -0.296116 -0.480410 -0.424021 -0.460480 -0.171059 0.111310 0.142861 0.148096 0.120343 0.359623 0.477233 -0.227740 -0.036101 0.030102 0.014532 -0.026130
polarizability: 2.53895851e+02 -4.11224537e+00 1.74466650e+02 3.67924916e-01 1.10565451e+01 1.14684111e+02
1716.lowfreq: -7.7659 -5.3245 -0.0013 -0.0012 -0.0012 7.5575 28.5300 31.8184 40.5059
frequency: 28.5233 31.7581 40.3710 55.2767 63.3861 88.7984 109.5823 125.5742 137.5492 156.4598 193.4743 204.6941 229.9172 242.2698 280.2146 308.3761 340.5728 349.5511 372.9229 406.9086 432.5876 470.8549 500.5852 524.2657 580.7491 590.5515 613.7447 617.1334 696.1953 703.3123 733.3295 758.1415 767.3982 785.3972 806.4740 806.7574 819.4760 840.4417 855.7072 884.9382 899.5635 915.3605 971.6716 983.6972 996.0935 998.6408 1001.6249 1005.4217 1029.0007 1034.3104 1076.2330 1080.8770 1090.6403 1108.3242 1112.5656 1118.9188 1133.8433 1147.9594 1155.5621 1171.5800 1173.0098 1188.9234 1241.5121 1254.6700 1258.9400 1313.8818 1355.0285 1389.6800 1432.5329 1449.3272 1455.7706 1462.8210 1472.4536 1485.6961 1514.6895 1600.5199 1613.7719 1622.1614 3080.0442 3085.3223 3089.1287 3092.2429 3107.7015 3133.0551 3144.7491 3166.0836 3187.1721 3190.2674 3194.2740 3204.1629 3208.7728 3517.5995 3536.0821
redmass: 4.6008 4.0028 4.2463 4.3195 3.1201 5.3711 7.8285 3.2968 5.1876 4.2100 4.5696 5.4485 4.4510 4.0631 4.8442 5.4768 6.4100 5.0789 4.5835 2.9257 6.0490 1.5951 4.1273 2.6553 5.8679 5.0579 6.4673 1.3203 1.9918 10.4792 6.4865 5.8511 1.7634 7.1112 1.1208 1.1092 8.2326 1.2780 5.0214 4.7490 4.5908 1.4339 1.3543 6.0193 1.1199 1.3099 1.2742 2.6414 3.0543 4.1222 1.2606 1.2657 1.5615 1.3283 1.3344 1.3157 1.2785 1.4033 1.3979 1.5976 1.0980 1.1125 3.2845 3.4460 2.1482 1.5327 1.8653 7.1196 2.4726 1.0776 1.0822 1.1804 1.1657 2.3473 2.2413 6.5523 4.7659 5.3371 1.0503 1.0488 1.0590 1.0585 1.0888 1.0867 1.0933 1.0997 1.1188 1.1188 1.0951 1.1179 1.1188 1.0774 1.0762
irintensity: 0.6568 0.3264 1.9112 1.1540 3.0888 2.5748 6.2058 1.9068 5.9769 2.6103 16.2792 5.4955 3.9243 3.4177 18.8474 6.6056 2.8260 5.2439 5.4893 0.0208 48.5876 19.5978 13.7963 45.4040 47.2906 58.7132 0.7071 133.1480 46.7663 55.0479 82.4070 43.2757 94.2316 13.8999 31.1140 26.5308 5.0594 0.2828 19.5314 215.9390 127.4343 16.0577 0.1559 3.3585 5.1901 2.6643 5.5680 25.9699 42.6475 60.7761 6.6274 3.3930 14.8761 9.4299 4.7547 8.2460 13.9100 0.5706 0.8803 86.2223 12.5523 2.9224 66.8292 55.0373 49.6085 21.2116 373.9493 240.0369 259.3894 12.8111 7.1298 19.5262 2.9743 40.4630 609.2705 80.2019 66.1183 102.3632 15.8972 17.2627 26.8762 32.0188 16.5994 0.2706 29.8477 25.0249 2.0787 5.0009 7.7196 12.1039 10.3538 26.7275 24.1572
temp: 298.150 k
press: 1.00000 atm
elementType: 15 8 8 7 7 7 7 6 6 6 6 6 6 6 6 6 6 6 1 1 1 1 1 1 1 1 1 1 1 1 1 1 1
symmnumber: 1
zpe: 668761.3 jmol-1
zpe.correction: 0.254718 hartree
zpe.thermalcorrener: 0.272994 hartree
zpe.thermalcorrenthalpy: 0.273938 hartree
zpe.thermalcorrgfe: 0.206320 hartree
zpe.sumelectzpe: -1137.424998 hartree
zpe.sumelectthermal: -1137.406722 hartree
zpe.sumelectthermalent: -1137.405778 hartree
zpe.sumelectthermalfe: -1137.473396 hartree
dipole: -0.4976 -2.5595 -4.2035
dipole: 4.9465
quadrupole: -99.9174 -97.4380 -123.7036
quadrupole: 0.2804 -5.5903 1.4204
quadrupole: 7.1023 9.5817 -16.6840 0.2804 -5.5903 1.4204
hfenergy: -1137.6797159 hartree
pointgroup: C01 [X(C11H15N4O2P1)]
dipole: 0.2727045 -0.8575903 1.7255306 debye
polarizability: 251.9219213|13.1790741|174.4744415|3.3410821|-14.9963208|116.6502494 unknown
InChI: InChI=1S/C11H15N4O2P/c16-11(12-10-4-2-1-3-5-10)13-18(17,14-6-7-14)15-8-9-15/h1-5,12-13H,6-9H2
charge 0 multiplicity 1
33 atoms
P  -2.591144 -0.408141 -0.484662
O  -2.755659 -0.539919 -2.068085
O  0.078978 1.060079 -0.720788
N  -3.417489 -1.64715 0.520947
N  -3.220659 1.101305 0.181345
N  -0.98302 -0.805601 0.178146
N  1.361108 -0.731448 0.143693
C  -4.108162 -2.776116 -0.238613
C  -4.929898 -1.709539 0.454679
C  -2.772218 2.450121 -0.327154
C  -2.471758 2.029934 1.104253
C  0.167353 -0.082124 -0.1729
C  2.690019 -0.222665 0.045516
C  3.740096 -1.069863 0.49261
C  2.994564 1.064811 -0.470263
C  5.079511 -0.636358 0.428679
C  4.341548 1.484417 -0.522243
C  5.390121 0.647075 -0.077879
H  -3.987304 -3.760213 0.223242
H  -4.052365 -2.742015 -1.333662
H  -5.446252 -0.973131 -0.17164
H  -5.404923 -1.9207 1.417247
H  -3.594219 3.140072 -0.539146
H  -1.922214 2.470817 -1.017834
H  -1.426492 1.796504 1.335969
H  -3.072356 2.414654 1.934112
H  -0.969838 -1.585664 0.84247
H  1.288778 -1.70001 0.461701
H  3.508196 -2.066731 0.890832
H  2.186587 1.705446 -0.827634
H  5.878439 -1.300948 0.77551
H  4.570312 2.47869 -0.922153
H  6.43036 0.985308 -0.127698
