program: Gaussian 09
title: 000192776
version: EM64L-G09RevD.01
frameworkgroup: C1[X(C12H8N4)]
method: RPBEPBE
basis: SDD
operation: Freq
keyword: #p
keyword: freq=noraman
keyword: PBEPBE/SDD
title: #p freq=noraman PBEPBE/SDD
converged: YES YES NO YES
title: Mulliken charges:
elementType: N N N N C C C C C C C C C C C C H H H H H H H H
charge: 0.032665 0.032665 0.215381 0.215380 0.382563 0.382563 -0.312493 -0.312495 -0.312488 -0.312486 -0.324841 -0.324942 -0.324882 -0.324780 0.435696 0.435697 0.292813 0.292797 0.292801 0.292818 0.311390 0.311400 0.311394 0.311383
chargesum: 2.00000
title: Mulliken charges with hydrogens summed into heavy atoms:
elementType: N N N N C C C C C C C C C C C C
charge: 0.032665 0.032665 0.215381 0.215380 0.382563 0.382563 -0.019680 -0.019698 -0.019687 -0.019668 -0.013451 -0.013541 -0.013487 -0.013397 0.435696 0.435697
polarizability: 3.90702882e+02 2.99766882e-02 1.24481730e+02 -4.94575261e-02 -2.80573424e-03 6.10528965e+01
1716.lowfreq: -5.9884 -1.9671 -0.0004 0.0003 0.0008 6.6275 41.4209 66.8685 67.4598
frequency: 41.4206 66.8685 67.4597 110.6915 152.3060 184.6198 200.6472 232.7515 287.6964 367.9195 386.6847 393.1583 456.2351 456.5687 503.5098 542.0429 546.0264 554.4776 566.1256 594.4797 628.9243 637.7950 706.5342 738.1161 750.2541 788.9214 831.2367 835.0685 838.5395 874.7222 981.0917 982.7409 984.3443 986.5919 988.2597 997.1912 1013.4466 1139.4352 1142.5856 1144.4759 1146.3021 1213.5079 1228.9172 1287.5138 1313.2784 1320.2216 1353.3440 1377.7125 1423.6339 1425.0658 1452.4881 1480.1539 1521.9803 1542.1565 1586.1159 1592.6265 2112.9305 2118.0704 3164.9078 3165.5917 3167.4091 3167.9155 3181.6861 3182.7438 3184.2670 3185.8048
redmass: 9.9912 3.7116 8.5650 8.9442 9.3256 7.2869 6.2285 9.9136 6.4220 5.1043 2.8179 2.8232 9.2359 5.4642 5.7270 7.9725 6.8740 4.7663 3.2420 6.5195 7.2311 7.5506 3.9239 3.3016 6.7507 6.4971 1.2488 1.2550 1.4346 1.7266 1.3448 4.4007 1.3719 1.5314 1.4377 2.9718 2.6939 1.5649 1.3456 3.7652 3.7319 1.1689 1.2067 3.3126 1.4256 1.2840 2.6787 8.6138 4.0651 3.0550 1.9070 2.3618 5.6188 7.0600 5.7209 5.4844 13.8664 13.8907 1.0903 1.0909 1.0897 1.0907 1.0986 1.0983 1.1000 1.0999
irintensity: 0.9250 0.0000 0.1026 0.0514 0.0095 0.9212 0.2872 0.0000 0.0159 2.6262 0.1427 0.0000 7.5478 10.4195 1.2762 1.6192 2.7310 26.0491 5.0475 0.0000 0.3984 0.0092 0.9984 0.6334 17.1201 0.0000 0.0065 0.0104 150.5097 14.0548 2.1442 14.2588 0.2149 0.0038 0.0000 0.0000 0.5292 8.8043 0.3475 328.4384 0.0001 0.0157 0.0000 0.0000 0.9053 0.0226 1.2794 2.2989 87.0338 8.2208 11.1906 0.0000 3.9410 0.0128 521.0838 0.0000 787.7517 0.0006 0.1009 2.6070 2.1343 0.0000 2.9685 27.2189 8.1960 0.0000
temp: 298.150 k
press: 1.00000 atm
elementType: 7 7 7 7 6 6 6 6 6 6 6 6 6 6 6 6 1 1 1 1 1 1 1 1
symmnumber: 1
zpe: 458159.6 jmol-1
zpe.correction: 0.174504 hartree
zpe.thermalcorrener: 0.187278 hartree
zpe.thermalcorrenthalpy: 0.188222 hartree
zpe.thermalcorrgfe: 0.134382 hartree
zpe.sumelectzpe: -679.310808 hartree
zpe.sumelectthermal: -679.298035 hartree
zpe.sumelectthermalent: -679.297090 hartree
zpe.sumelectthermalfe: -679.350930 hartree
dipole: 0.0000 -0.0001 0.0000
dipole: 0.0001
quadrupole: 66.5861 -60.9087 -86.4002
quadrupole: -0.0037 -0.0044 -0.0011
quadrupole: 93.4937 -34.0011 -59.4926 -0.0037 -0.0044 -0.0011
hfenergy: -679.4853122 hartree
pointgroup: C01 [X(C12H8N4)]
dipole: -0.0000011 -0.0000321 -0.0000115 debye
dipolederiv: 2.4392191 -0.0004516 0.000656 0.0011364 0.0686573 -0.0482294 -0.0022748 -0.0420029 0.2036731 2.4392153 -0.0005452 0.0003575 0.0015449 0.0686638 0.0482428 -0.0012485 0.0420161 0.2036655 -0.9295428 0.000622 -0.0009894 -0.0012076 0.1478279 0.0016572 0.0020508 -0.0004163 0.1471194 -0.9295396 0.000914 -0.0006124 -0.0020218 0.1478289 -0.001659 0.0013463 0.0004145 0.1471187 0.5994669 -0.000009 -0.0000211 0.0000342 0.2155778 0.0696349 0.0000231 0.0473964 0.0669077 0.5994648 0.0000281 -0.0000275 0.0001149 0.2155679 -0.0696479 -0.0001306 -0.0474096 0.0669176 -0.5926399 -0.3031005 -0.1111554 -0.1987333 -0.0588067 0.0198208 -0.1081908 0.015868 -0.0650225 -0.5926074 0.3031056 -0.111211 0.1990528 -0.0588188 -0.0198315 -0.1082852 -0.0159193 -0.0650229 -0.5927533 0.3030956 0.1112593 0.1989898 -0.0588861 0.0198068 0.1081249 0.0159882 -0.0649984 -0.5927841 -0.303071 0.1112564 -0.1986502 -0.0588808 -0.019797 0.1080652 -0.0159374 -0.0649914 0.616172 0.2068728 0.0687396 -0.3831418 0.0088055 0.0113784 -0.0802269 0.0185612 -0.0217726 0.6164924 -0.206868 0.0687849 0.382875 0.0088845 -0.0113373 -0.0797847 -0.0186073 -0.0217398 0.6163734 -0.2068636 -0.0688578 0.3833303 0.0088549 0.0112158 0.0792192 0.0186544 -0.0217831 0.6160523 0.2068572 -0.0688491 -0.3835844 0.0087703 -0.0112623 0.0797258 -0.0186152 -0.0218104 -1.4586973 -0.0001546 0.0003592 -0.0001712 0.237437 0.0457711 0.0010292 0.0495871 0.1056304 -1.4586958 -0.0003167 0.0002591 0.0006869 0.2374286 -0.0457823 0.0000765 -0.0495977 0.105639 0.0812791 0.050986 0.0150717 0.0525313 0.0837924 -0.0237393 0.0300131 -0.0111691 0.1469267 0.0812594 -0.0509994 0.0150737 -0.0526697 0.083785 0.0237568 0.0299445 0.0112053 0.1468972 0.0812413 -0.051 -0.0150564 -0.0527246 0.0838159 -0.0237502 -0.0297194 -0.0112502 0.1468884 0.0812605 0.0509842 -0.0150633 0.0525811 0.0838296 0.0237436 -0.0297967 0.011225 0.1469116 0.0699297 -0.0113348 -0.0039794 0.0221346 0.1314543 -0.0169704 -0.0019315 -0.0212459 0.1782176 0.0700357 0.011292 -0.0039677 -0.0221218 0.1314865 0.0169715 -0.0019477 0.0212516 0.1782104 0.0699522 0.0113205 0.0039795 -0.0221439 0.1314744 -0.0169805 0.0019686 -0.0212661 0.1782088 0.0698458 -0.0113635 0.0039937 0.0221579 0.1314499 0.0169874 0.0019496 0.0212692 0.178209 unknown
polarizability: 390.7028808|0.0356411|124.4817313|-0.0494575|-0.0028068|61.0528965 unknown
InChI: InChI=1S/C12H8N4/c13-15-11-5-1-9(2-6-11)10-3-7-12(16-14)8-4-10/h1-8H
charge 2 multiplicity 1
24 atoms
N  4.943445 -0.000518 0.000364
N  -4.943428 0.000497 -0.000271
N  6.098741 0.000709 -0.001759
N  -6.098725 -0.001547 0.001111
C  0.745464 -0.000085 0.00006
C  -0.745447 0.000061 -0.000018
C  1.470023 1.177049 0.362977
C  -1.469775 1.177304 -0.363046
C  1.469826 -1.177355 -0.362805
C  -1.47004 -1.177037 0.362942
C  2.871713 1.19556 0.373227
C  -2.871461 1.196093 -0.373321
C  2.871514 -1.196128 -0.372973
C  -2.871732 -1.195531 0.373087
C  3.554881 -0.000375 0.000236
C  -3.554863 0.000339 -0.000173
H  0.940691 2.081364 0.677337
H  -0.940265 2.081489 -0.677483
H  0.940345 -2.081569 -0.67721
H  -0.940736 -2.081325 0.677428
H  3.422199 2.095359 0.664341
H  -3.421765 2.095973 -0.66453
H  3.421846 -2.096028 -0.66406
H  -3.422252 -2.095297 0.66424
