program: Gaussian 09
title: 000192771
version: EM64L-G09RevD.01
frameworkgroup: C1[X(C8H11NO4)]
method: RPBEPBE
basis: SDD
operation: Freq
keyword: #p
keyword: freq=noraman
keyword: PBEPBE/SDD
title: #p freq=noraman PBEPBE/SDD
converged: YES YES NO NO
title: Mulliken charges:
elementType: O O O O N C C C C C C C C H H H H H H H H H H H
charge: -0.493138 -0.454379 -0.495348 -0.437147 -0.641364 -0.133418 0.344945 -0.465723 0.128166 -0.503886 0.171248 -0.505503 0.169856 0.218134 0.233408 0.252053 0.292775 0.241448 0.372630 0.300829 0.289507 0.356948 0.373884 0.384073
chargesum: 0.00000
title: Mulliken charges with hydrogens summed into heavy atoms:
elementType: O O O O N C C C C C C C C
charge: -0.120508 -0.097431 -0.121463 -0.053074 -0.051028 0.084716 0.344945 0.019738 0.128166 -0.211110 0.171248 -0.264055 0.169856
polarizability: 1.50261707e+02 3.93392352e+00 1.17678436e+02 -4.66505306e+00 -1.13879653e+00 6.01809593e+01
1716.lowfreq: -4.8535 -0.0010 -0.0004 -0.0002 4.7831 4.8408 57.6731 79.0959 93.3621
frequency: 57.6494 79.0928 93.3107 144.6148 176.9951 216.2260 243.0810 273.5356 276.6795 280.8033 296.9722 313.6528 336.0872 356.6856 404.9241 444.4548 460.4319 494.0882 507.4454 566.2195 604.0488 654.8153 690.6730 708.7708 718.1951 752.3924 792.3139 817.9887 841.6138 887.0100 891.6767 930.4744 1031.3328 1059.5545 1063.5775 1095.1134 1132.8944 1149.5358 1158.5020 1184.1959 1233.6233 1270.1362 1277.7073 1279.4272 1302.6444 1343.6629 1349.6037 1404.7310 1426.4067 1440.5266 1467.1679 1524.9233 1631.6434 1635.2354 1638.6134 2931.3411 2995.8062 3070.0923 3143.1601 3146.0011 3203.7430 3460.6925 3524.0299 3584.9925 3591.4531 3628.4202
redmass: 4.7307 4.6467 2.7227 5.7548 4.5828 3.6674 1.2683 3.2170 4.0227 1.9892 2.7017 1.1489 3.6518 6.4216 6.5884 3.0308 7.2749 1.1390 2.6730 6.5625 3.7284 7.5939 4.0965 2.1680 1.7861 5.2158 1.1291 1.6896 3.1145 1.3780 2.9133 1.5873 4.1426 3.2474 3.8933 2.1495 1.4230 1.2621 1.3308 1.7635 1.5496 1.3275 1.7845 1.2977 1.3231 1.6428 1.5725 1.8837 4.4347 3.4989 1.0859 3.8568 7.1626 6.9339 1.1013 1.0832 1.0600 1.1048 1.0914 1.0923 1.0632 1.0463 1.0648 1.0970 1.0661 1.0665
irintensity: 6.5798 0.3374 6.0302 3.4856 0.8133 30.0344 130.2970 23.4541 2.6886 13.5072 22.0981 101.8338 4.1477 16.0513 11.4429 28.6927 2.1713 136.2428 10.3352 27.6300 0.1248 3.8610 18.3374 26.5165 112.3475 29.2706 173.1707 29.9082 31.2253 50.8291 42.4830 1.3607 9.0984 30.8129 80.0946 383.1442 17.2420 22.3868 72.3057 63.9179 125.8736 18.3677 74.5424 22.1609 22.3288 3.7696 6.5250 30.7713 80.6832 144.0567 10.2404 103.7392 40.9855 16.0838 34.0450 41.3904 27.8488 23.8882 7.1770 5.9040 180.1707 0.2582 85.3314 5.8650 29.5099 49.3923
temp: 298.150 k
press: 1.00000 atm
elementType: 8 8 8 8 7 6 6 6 6 6 6 6 6 1 1 1 1 1 1 1 1 1 1 1
symmnumber: 1
zpe: 488635.1 jmol-1
zpe.correction: 0.186111 hartree
zpe.thermalcorrener: 0.199343 hartree
zpe.thermalcorrenthalpy: 0.200287 hartree
zpe.thermalcorrgfe: 0.147133 hartree
zpe.sumelectzpe: -666.084231 hartree
zpe.sumelectthermal: -666.070999 hartree
zpe.sumelectthermalent: -666.070055 hartree
zpe.sumelectthermalfe: -666.123209 hartree
dipole: 2.5729 0.5901 1.7499
dipole: 3.1670
quadrupole: -66.4948 -63.9068 -79.1837
quadrupole: 7.9233 6.3992 -3.7463
quadrupole: 3.3670 5.9550 -9.3219 7.9233 6.3992 -3.7463
hfenergy: -666.2703419 hartree
pointgroup: C01 [X(C8H11N1O4)]
dipole: -0.9994972 -0.2031477 0.7157356 debye
dipolederiv: -0.7024351 0.0819897 0.0034509 0.2354826 -0.6402011 0.0705057 -0.0527524 0.1271963 -0.6317959 -0.4332079 -0.5528789 0.0119368 -0.5169531 -1.0256968 -0.025398 0.0517422 -0.0124527 -0.3975355 -0.5981578 -0.5797621 0.0632479 -0.6585154 -1.016696 -0.030046 0.0436399 -0.0441538 -0.4185412 -1.5163822 -0.0445941 -0.1149262 0.0035838 -0.1480859 -0.0247984 -0.1491944 -0.0334923 -0.4285808 -0.8032895 0.1090664 0.0743268 0.1194915 -0.4812992 0.2111481 0.1199646 0.2321358 -0.4027828 0.333468 -0.1215722 0.0547995 -0.2889101 0.4796529 0.0354293 0.2190702 -0.0190249 0.3541062 0.1132916 0.0825182 -0.013728 -0.288518 -0.2553678 -0.0019902 0.0686961 0.0176556 -0.1112238 0.5583135 -0.1261632 0.0195981 0.059561 0.1843366 -0.001283 -0.2010458 0.0333593 0.0874753 0.3181148 0.3427552 0.0306467 0.5392445 0.9685617 0.0029071 -0.0225534 -0.0269568 0.0389406 0.0078491 -0.081763 0.0501966 0.1010922 -0.0310172 -0.001947 0.0457697 -0.0446537 -0.1282458 0.0341117 0.4545329 -0.0370781 0.8931152 0.8237262 0.0166339 -0.0913879 -0.0212439 -0.027583 -0.2735412 -0.1407185 0.0054142 -0.1195982 -0.1089114 -0.0292179 0.0064428 -0.0290014 -0.2142034 1.3503865 0.1287711 0.1407068 -0.2924964 0.0381838 -0.0214719 0.1989471 0.0279687 0.1008798 -0.0641513 -0.029818 -0.060928 -0.0339331 -0.1025629 -0.0804694 -0.0461858 -0.0862806 -0.067459 0.0244245 -0.0225154 -0.0560889 -0.0089444 0.0150822 -0.1164619 -0.0644278 -0.0603013 -0.0447892 0.0260258 0.0271095 -0.0132627 0.028429 -0.1264831 0.0933759 -0.0159145 0.0549486 0.0591731 0.1874127 0.0251029 -0.0107907 0.0123738 -0.0163268 0.0159205 0.0061306 0.0212944 0.1640309 0.0657595 0.0370326 -0.0181545 0.0544875 -0.0616505 0.0267161 -0.0232205 0.0300534 0.1805079 0.3659781 0.0664812 -0.0763773 0.0205076 0.313716 -0.0582072 -0.0895626 -0.0797781 0.4151731 0.0774689 0.0127784 0.0439976 -0.0492775 0.2932607 -0.0273367 0.0854343 -0.0802529 0.0922379 0.1131953 -0.0217108 -0.0276718 -0.0904511 0.1441982 -0.1218579 -0.026856 -0.0905806 0.2359167 0.1419221 0.191826 -0.0172113 0.1186945 0.2755752 0.0155452 -0.0306325 0.0129515 0.367976 0.2135798 0.1663275 -0.0590924 0.1352912 0.3054209 0.0322605 -0.0423725 0.0503301 0.3872379 0.4598632 -0.0047956 0.006988 0.0262428 0.1725842 0.0200436 0.0102685 0.0202793 0.3890849 unknown
polarizability: 149.8754769|5.7767944|117.7365294|3.8231727|-4.6764205|60.5090962 unknown
InChI: InChI=1S/C8H11NO4/c9-3-8(13)4-1-6(11)7(12)2-5(4)10/h1-2,8,10-13H,3,9H2
charge 0 multiplicity 1
24 atoms
O  -2.31584 1.407744 -0.900737
O  -0.662326 -2.427878 -0.056683
O  2.629863 2.141413 -0.008893
O  3.7316 -0.298817 0.36962
N  -4.162588 0.25911 0.628368
C  -1.958937 0.0633 -0.454937
C  -0.460299 -0.029434 -0.236698
C  -2.772924 -0.22623 0.848786
C  0.172403 -1.281869 -0.039159
C  0.341437 1.135386 -0.231572
C  1.727451 1.045094 -0.02846
C  1.5674 -1.383434 0.16861
C  2.348746 -0.213426 0.173051
H  -2.257531 -0.685649 -1.22188
H  -2.335175 0.364023 1.673495
H  -2.698183 -1.299712 1.105873
H  -0.164514 2.089744 -0.415726
H  2.063586 -2.347865 0.325154
H  -3.271045 1.490533 -0.575115
H  -4.628342 0.614955 1.467826
H  -4.7599 -0.40183 0.119252
H  -0.118465 -3.250706 0.00902
H  2.169844 2.989727 -0.212944
H  4.107739 0.620223 0.331847
