program: Gaussian 09
title: 000192757
version: EM64L-G09RevD.01
frameworkgroup: C1[X(C10H14O3)]
method: RPBEPBE
basis: SDD
operation: Freq
keyword: #pfreq=noraman
keyword: PBEPBE/SDD
title: #p freq=noraman PBEPBE/SDD
converged: YES YES NO NO
title: Mulliken charges:
elementType: O O O C C C C C C C C C C H H H H H H H H H H H H H H
charge: -0.446859 -0.480501 -0.481735 0.356311 0.215357 0.197143 -0.587331 -0.025905 0.035853 -0.078281 -0.889935 -0.853374 -0.687329 0.235048 0.206884 0.231498 0.232467 0.259187 0.283656 0.227533 0.222088 0.220355 0.216527 0.225453 0.385707 0.384339 0.395845
chargesum: 0.00000
title: Mulliken charges with hydrogens summed into heavy atoms:
elementType: O O O C C C C C C C C C C
charge: -0.061152 -0.096162 -0.085890 0.356311 0.215357 0.197143 -0.145399 -0.025905 0.035853 -0.078281 -0.166783 -0.120098 -0.024993
polarizability: 1.48848231e+02 -7.80867009e-02 1.42783043e+02 -4.51433578e+00 -4.71506850e-02 6.95279647e+01
1716.lowfreq: -11.8669 -4.4460 -0.0007 -0.0007 0.0004 9.9935 57.1277 84.9749 105.5551
frequency: 56.5889 84.9558 105.4868 124.3929 159.3495 161.7336 174.1559 195.5502 208.3296 257.5511 263.3399 298.4486 310.5870 318.4425 362.0704 385.4585 397.5573 411.3005 447.9363 464.0550 471.2852 541.5264 584.7555 608.0622 630.4153 657.3507 763.3814 786.1763 820.5345 874.5456 955.2390 999.9473 1019.4130 1030.5039 1038.0372 1060.1226 1072.3987 1088.8097 1103.2934 1160.4241 1224.5846 1249.7464 1252.7129 1262.5605 1311.2918 1368.7648 1385.9076 1396.3171 1398.7382 1406.5258 1448.5221 1465.3425 1469.3346 1478.0103 1480.7279 1486.4872 1490.0859 1503.0171 1515.7101 1630.2677 1640.2530 2946.0873 2975.1416 2976.0727 3000.3177 3007.0447 3045.9755 3048.6191 3073.2133 3079.6430 3107.4229 3109.0413 3525.4588 3566.5841 3617.6349
redmass: 1.8627 3.3995 1.3447 3.3653 1.0376 4.7808 2.8579 1.2209 1.0446 4.4552 4.9372 4.2693 3.2951 3.0353 4.3175 2.3062 3.8749 1.2160 6.4434 5.4191 1.1069 5.2216 5.8604 5.9074 2.6482 5.6172 5.2698 1.2590 2.7657 3.1526 2.1450 1.7232 1.9990 1.5456 1.4617 2.2760 3.0320 2.1739 1.7945 1.5232 1.4726 1.2518 3.8493 1.6391 1.5166 4.3385 1.3193 1.3369 1.3480 2.6368 2.3157 1.1852 1.0464 1.5915 1.0645 1.1072 1.0618 2.2181 1.1427 7.0847 7.9172 1.0428 1.0399 1.0349 1.0631 1.0978 1.0971 1.0968 1.0996 1.1009 1.0963 1.0903 1.0650 1.0653 1.0659
irintensity: 0.6797 0.1751 0.0953 1.9775 0.0619 0.9720 3.1667 150.3443 0.2360 0.6020 4.1146 8.5974 7.7478 6.0559 0.0774 0.3511 3.5312 198.6720 2.9383 0.6291 102.6820 4.7263 0.4867 0.1340 15.8655 1.0865 0.4956 7.2697 36.2709 80.5798 6.5949 10.0972 89.6016 5.5625 0.1371 18.6046 118.1646 7.1533 10.7691 47.5754 224.8274 13.3560 43.7841 252.1237 4.2302 26.5231 14.7108 11.6372 11.8578 1.7566 40.3859 3.1444 12.7268 14.6246 5.7392 19.5025 7.0119 61.7976 27.2319 7.6768 33.3196 51.0221 34.2543 41.0625 35.1958 23.6823 16.5403 10.3387 59.6626 47.6828 4.3220 12.0651 72.4197 83.1482 43.4312
temp: 298.150 k
press: 1.00000 atm
elementType: 8 8 8 6 6 6 6 6 6 6 6 6 6 1 1 1 1 1 1 1 1 1 1 1 1 1 1
symmnumber: 1
zpe: 576580.2 jmol-1
zpe.correction: 0.219608 hartree
zpe.thermalcorrener: 0.234187 hartree
zpe.thermalcorrenthalpy: 0.235131 hartree
zpe.thermalcorrgfe: 0.179446 hartree
zpe.sumelectzpe: -614.138561 hartree
zpe.sumelectthermal: -614.123982 hartree
zpe.sumelectthermalent: -614.123038 hartree
zpe.sumelectthermalfe: -614.178723 hartree
dipole: 1.2043 3.2759 -0.1513
dipole: 3.4935
quadrupole: -72.6073 -71.3227 -80.8753
quadrupole: -2.1860 -1.1529 -0.4793
quadrupole: 2.3278 3.6124 -5.9402 -2.1860 -1.1529 -0.4793
hfenergy: -614.3581688 hartree
pointgroup: C01 [X(C10H14O3)]
dipole: -0.4654971 1.2918885 0.0590493 debye
polarizability: 148.9927261|0.0519755|142.7780599|-2.9926392|0.5589642|69.388453 unknown
InChI: InChI=1S/C10H14O3/c1-4-7-5(2)8(11)10(13)9(12)6(7)3/h11-13H,4H2,1-3H3
charge 0 multiplicity 1
27 atoms
O  1.725995 -2.412117 -0.06483
O  1.782467 2.37302 -0.016845
O  3.080663 -0.037472 -0.172142
C  -1.133601 -0.018772 0.263569
C  -0.445495 1.232296 0.199974
C  -0.417072 -1.253406 0.173334
C  -2.65414 -0.056531 0.393984
C  0.990596 -1.217668 0.025085
C  0.963418 1.215001 0.056914
C  1.678261 0.011067 -0.028536
C  -1.134129 2.58864 0.266876
C  -1.105698 -2.607229 0.231517
C  -3.378208 0.070582 -0.974385
H  -2.963629 -1.003861 0.868903
H  -3.007874 0.746159 1.068003
H  -0.801952 3.181956 1.144414
H  -0.940434 3.193998 -0.642909
H  -2.226753 2.494526 0.348715
H  -0.378895 -3.410855 0.038125
H  -1.555494 -2.794135 1.225891
H  -1.91652 -2.688627 -0.515768
H  -3.129546 1.026346 -1.470922
H  -4.476089 0.022564 -0.849766
H  -3.073413 -0.743724 -1.656485
H  2.68708 -2.181559 -0.16575
H  1.248684 3.197234 0.081561
H  3.435078 0.887667 -0.19643
