program: Gaussian 09
title: 000192748
version: EM64L-G09RevD.01
frameworkgroup: C1[X(C3HBrN2)]
method: RPBEPBE
basis: SDD
operation: Freq
keyword: #p
keyword: freq=noraman
keyword: PBEPBE/SDD
title: #p freq=noraman PBEPBE/SDD
converged: NO YES NO NO
title: Mulliken charges:
elementType: Br N N C C C H
charge: 0.125540 0.042136 0.042108 -0.529337 -0.020231 -0.020153 0.359938
chargesum: 0.00000
title: Mulliken charges with hydrogens summed into heavy atoms:
elementType: Br N N C C C
charge: 0.125540 0.042136 0.042108 -0.169399 -0.020231 -0.020153
polarizability: 6.78461472e+01 4.19655973e-03 5.88505612e+01 -8.91568535e-01 1.89925465e-03 2.92280067e+01
1716.lowfreq: -0.0007 -0.0007 -0.0006 3.9139 5.3537 9.9633 125.7341 149.1751 182.5429
frequency: 125.7341 149.1731 182.5429 366.7072 373.3820 450.4255 574.5344 653.6852 889.4974 1026.6272 1126.2520 1276.7757 2202.7054 2203.5348 3065.2151
redmass: 15.5391 13.1896 11.0489 8.1862 14.7986 12.0745 12.4055 5.9971 9.2169 3.5722 1.1074 1.3961 12.5602 12.5557 1.0836
irintensity: 3.6034 1.8877 7.3889 0.1281 11.6901 0.1142 0.6337 38.9186 30.5823 22.7384 9.2777 1.5447 2.2218 5.7103 5.4886
temp: 298.150 k
press: 1.00000 atm
elementType: 35 7 7 6 6 6 1
symmnumber: 1
zpe: 87726.9 jmol-1
zpe.correction: 0.033413 hartree
zpe.thermalcorrener: 0.039541 hartree
zpe.thermalcorrenthalpy: 0.040485 hartree
zpe.thermalcorrgfe: 0.001809 hartree
zpe.sumelectzpe: -237.398191 hartree
zpe.sumelectthermal: -237.392064 hartree
zpe.sumelectthermalent: -237.391119 hartree
zpe.sumelectthermalfe: -237.429795 hartree
dipole: 1.7206 -0.0007 2.2358
dipole: 2.8212
quadrupole: -47.1334 -54.9020 -40.4050
quadrupole: -0.0033 -3.3897 0.0004
quadrupole: 0.3467 -7.4219 7.0751 -0.0033 -3.3897 0.0004
hfenergy: -237.4316042 hartree
pointgroup: C01 [X(C3H1Br1N2)]
dipole: 0.0001009 -0.7409367 -0.8264249 debye
dipolederiv: -0.1191141 -0.0000235 -0.0000029 -0.0000037 -0.4043315 0.0185827 0.0000135 0.1152707 -0.0278064 -0.0625021 0.0501906 0.0517078 0.0598401 -0.1090801 0.0309239 0.0352017 0.0105295 -0.1505014 -0.0620576 -0.049947 -0.0515753 -0.0598007 -0.1094003 0.0307831 -0.03524 0.0104142 -0.1505894 0.545761 -0.0000217 -0.0000102 0.0000467 0.9395321 -0.1267373 0.0000688 -0.2147841 0.3458079 -0.1762976 -0.0317388 -0.0039204 -0.0228157 -0.1630827 -0.0076339 -0.0424292 0.0189107 -0.049004 -0.1768724 0.0315346 0.0037787 0.0226995 -0.1627257 -0.0074949 0.0424012 0.0190442 -0.04886 0.0510828 0.0000058 0.0000223 0.0000339 0.0090882 0.0615763 -0.0000161 0.0406149 0.0809532 unknown
polarizability: 58.8505636|0.0062655|67.4960813|0.0002465|-3.767115|29.5780702 unknown
InChI: InChI=1S/C3HBrN2/c4-3(1-5)2-6/h3H
charge 0 multiplicity 1
7 atoms
Br -0.000029 -2.24322 0.247069
N  2.223445 0.928415 0.223076
N  -2.223836 0.927587 0.223083
C  0.000034 -0.332879 -0.506977
C  1.222847 0.359007 -0.088571
C  -1.222532 0.359232 -0.08822
H  -0.00013 -0.486044 -1.599759
