program: Gaussian 09
title: 000192746
version: EM64L-G09RevD.01
frameworkgroup: C1[X(C9H10N2O)]
method: RPBEPBE
basis: SDD
operation: Freq
keyword: #p
keyword: freq=noraman
keyword: PBEPBE/SDD
title: #p freq=noraman PBEPBE/SDD
converged: YES YES NO NO
title: Mulliken charges:
elementType: O N N C C C C C C C C C H H H H H H H H H H
charge: -0.235631 -0.255081 -0.426782 0.353630 -0.597702 0.314737 -0.497872 0.123888 -0.405142 -0.394937 -0.243938 -0.215224 0.233297 0.243462 0.259133 0.217210 0.268211 0.320319 0.234039 0.241020 0.231257 0.232108
chargesum: 0.00000
title: Mulliken charges with hydrogens summed into heavy atoms:
elementType: O N N C C C C C C C C C
charge: -0.235631 0.013129 -0.106463 0.353630 -0.120944 0.314737 -0.021530 0.123888 -0.171103 -0.153917 -0.012681 0.016884
polarizability: 1.55225151e+02 3.37380066e+00 1.12513549e+02 4.69372373e+00 -8.77353585e-01 6.39152685e+01
1716.lowfreq: -14.7713 -1.8812 -0.0009 -0.0007 -0.0004 5.6085 84.5497 109.4453 143.0075
frequency: 84.5357 109.4419 142.9698 191.0758 309.2543 323.2854 340.9193 364.2728 428.6729 457.0051 499.5330 532.8148 565.4918 608.2297 628.7533 646.9877 692.5078 733.6343 762.4439 799.7347 844.1387 864.0704 898.9224 908.6581 946.3095 983.8777 994.6039 1005.5395 1040.9692 1114.2967 1141.5104 1173.4342 1181.8766 1198.3401 1228.2726 1240.3329 1289.3134 1316.8276 1344.3777 1346.1480 1370.4251 1408.5968 1454.2587 1457.2689 1459.1216 1472.7853 1484.0080 1589.6757 1611.3584 1632.6685 2871.1583 2977.9194 3063.7303 3073.5822 3119.7642 3127.7232 3144.8338 3165.7827 3447.8809 3504.5415
redmass: 5.5278 3.8129 4.2142 2.5930 2.7087 3.9847 5.5656 4.9573 2.5278 4.0990 3.7894 3.0775 1.9802 3.3186 3.3797 1.8121 2.7211 3.0870 1.6181 2.9657 5.0597 1.5628 3.5434 2.1613 1.4073 1.3277 1.9648 2.1719 2.1568 1.7403 5.0197 1.0587 1.5211 2.0636 1.8043 1.3055 1.5409 2.4875 1.2687 1.4399 2.9023 2.2801 1.5777 1.7342 1.1686 1.1229 2.2878 6.9295 6.4146 5.7517 1.0705 1.0660 1.0968 1.0892 1.0877 1.0886 1.0933 1.1006 1.0753 1.0756
irintensity: 2.1884 2.2830 0.6143 4.4687 2.6138 9.5435 1.8164 1.2467 23.0245 9.4344 11.1345 15.5010 67.1576 69.6545 10.0392 72.4319 24.5337 21.0677 78.4734 13.7443 3.0991 0.4250 4.6401 1.8985 2.6484 0.0229 22.8763 0.7775 10.2873 15.1436 17.0604 0.9248 12.8503 30.2962 8.2678 9.3184 2.8554 154.2090 8.4112 46.4922 3.1398 2.1525 2.5847 30.5157 14.1247 12.8114 46.3739 26.2875 37.7007 386.4614 71.3671 33.4951 19.7543 17.3322 9.6919 2.9216 22.1971 25.0868 0.4327 22.6887
temp: 298.150 k
press: 1.00000 atm
elementType: 8 7 7 6 6 6 6 6 6 6 6 6 1 1 1 1 1 1 1 1 1 1
symmnumber: 1
zpe: 464871.6 jmol-1
zpe.correction: 0.177060 hartree
zpe.thermalcorrener: 0.186734 hartree
zpe.thermalcorrenthalpy: 0.187679 hartree
zpe.thermalcorrgfe: 0.142132 hartree
zpe.sumelectzpe: -532.814540 hartree
zpe.sumelectthermal: -532.804866 hartree
zpe.sumelectthermalent: -532.803922 hartree
zpe.sumelectthermalfe: -532.849469 hartree
dipole: 4.6040 0.8850 1.0453
dipole: 4.8034
quadrupole: -82.5637 -62.3078 -70.2598
quadrupole: -4.1449 -2.5872 2.1059
quadrupole: -10.8532 9.4026 1.4506 -4.1449 -2.5872 2.1059
hfenergy: -532.9916007 hartree
pointgroup: C01 [X(C9H10N2O1)]
dipole: 1.7741592 -0.2429392 -0.6038816 debye
dipolederiv: -1.3375407 0.1558715 0.0996133 0.3457355 -0.5124852 -0.1374293 0.3017222 -0.1390251 -0.4519228 -0.6012542 -0.290865 -0.0735866 -0.1620241 -0.4622483 0.2004365 0.0066887 0.1894964 -0.3132336 -1.5028558 0.1626086 0.1286127 -0.2402492 -0.2832681 0.0381598 -0.26851 0.034969 -0.3551917 -0.1665565 0.0431286 -0.057227 0.2157544 -0.0640446 -0.0588058 0.0189785 -0.0153941 -0.1312002 0.3520068 0.1218405 0.079007 0.1066235 0.2603588 0.0100816 0.0992938 -0.0441798 0.3737321 0.8525901 -0.2232835 -0.2012887 -0.3872275 0.1338397 0.0155616 -0.220718 0.0521888 0.0989737 0.2474588 0.0180338 0.0126707 -0.062787 0.2233657 -0.3332843 0.0208941 -0.2867049 0.1559308 2.097263 -0.1741781 -0.0829867 0.2332229 0.4530368 0.2916765 -0.0022471 0.3252125 0.3959954 0.0412474 -0.0441977 -0.047258 -0.0843771 0.0939221 0.0052202 -0.0231924 0.0094685 -0.1322073 -0.2543224 0.0517896 0.0036737 -0.0795741 0.0667015 0.0241249 -0.0130565 -0.0029312 -0.1589539 -0.0259965 -0.0484646 -0.0525421 -0.0756415 -0.0915688 0.0209436 -0.0260236 0.0265988 -0.1478177 0.0359583 0.0171091 -0.0606932 0.0861521 0.0652369 -0.0214302 -0.0751205 -0.007974 -0.1292018 0.0058818 0.1056809 -0.0459282 0.0464433 -0.1103605 0.0459078 -0.0064819 -0.0171828 0.0873585 -0.0154632 -0.0423681 0.0664022 -0.0341676 0.0583939 -0.0964135 0.0090901 -0.0250789 -0.1094443 -0.0971577 0.001568 -0.0973143 0.0141655 0.0593233 0.0106099 -0.0490282 0.0126871 0.0572834 0.0344545 -0.0620578 0.1454824 0.0036416 -0.0951961 0.114171 0.0615402 0.0939802 -0.1074446 0.2070525 0.1986455 0.0198808 0.0866977 0.1551166 -0.0585076 -0.0653574 -0.1164049 0.0296275 0.0903292 -0.0136605 -0.0002768 -0.0605874 0.1877225 -0.0698942 0.0763227 -0.0825777 0.2550596 0.0779866 0.0052395 0.0198073 0.0598005 -0.1115312 -0.0051153 0.0058618 0.0030411 0.1400041 0.0802068 0.0656831 0.0275222 0.0360608 -0.0889128 -0.0075123 0.0222679 -0.0097948 0.1543063 -0.0953279 0.0497477 0.0696457 0.0603008 0.0654969 -0.0168007 0.0714651 -0.020575 0.1446546 -0.0259608 -0.0978709 0.0467836 -0.1079631 -0.0028992 0.0282997 0.0556105 0.0201808 0.1436922 unknown
polarizability: 153.7635283|-1.0721362|112.0080041|-13.0402275|4.2290355|65.8824369 unknown
InChI: InChI=1S/C9H10N2O/c12-9-6-10-5-7-3-1-2-4-8(7)11-9/h1-4,10-11H,5-6H2
charge 0 multiplicity 1
22 atoms
O  -3.226309 1.032326 0.643533
N  -1.613262 -1.90034 -0.27437
N  -0.910091 1.037971 0.626865
C  0.654895 -0.829149 0.198307
C  -0.435299 -1.807497 0.629045
C  0.386188 0.570843 0.245132
C  -2.100361 -0.607299 -0.81878
C  -2.150394 0.517498 0.225892
C  1.94594 -1.25515 -0.19077
C  1.409274 1.508557 -0.042568
C  2.966906 -0.325244 -0.492314
C  2.697803 1.060525 -0.403051
H  -0.016366 -2.822843 0.738647
H  -0.803246 -1.500179 1.62825
H  -3.131858 -0.73716 -1.184295
H  -1.473055 -0.227596 -1.662874
H  -1.468243 -2.579543 -1.033087
H  -0.973562 1.891293 1.191565
H  2.160017 -2.330451 -0.230482
H  1.189425 2.581833 0.00219
H  3.963644 -0.675434 -0.780674
H  3.484154 1.79024 -0.624561
