program: Gaussian 09
title: 000192744
version: EM64L-G09RevD.01
frameworkgroup: C1[X(C12H8N2O4)]
method: RPBEPBE
basis: SDD
operation: Freq
keyword: #p
keyword: freq=noraman
keyword: PBEPBE/SDD
title: #p freq=noraman PBEPBE/SDD
converged: YES YES NO NO
title: Mulliken charges:
elementType: O O O O N N C C C C C C C C C C C C H H H H H H H H
charge: -0.431739 -0.431739 -0.243206 -0.243206 -0.046472 -0.046472 0.084511 0.084511 -0.261256 -0.261256 0.280064 0.280064 -0.281194 -0.281193 -0.463774 -0.463774 0.112781 0.112780 0.293842 0.293842 0.281291 0.281290 0.285289 0.285289 0.389863 0.389863
chargesum: 0.00000
title: Mulliken charges with hydrogens summed into heavy atoms:
elementType: O O O O N N C C C C C C C C C C C C
charge: -0.041876 -0.041876 -0.243206 -0.243206 -0.046472 -0.046472 0.084511 0.084511 0.032586 0.032586 0.280064 0.280064 0.000097 0.000097 -0.178485 -0.178485 0.112781 0.112780
polarizability: 3.31834754e+02 -5.43961937e+00 1.50668941e+02 -6.97962922e-04 -1.14974033e-04 5.95949945e+01
1716.lowfreq: -6.3559 -4.9133 -0.0008 -0.0006 -0.0001 9.7050 32.6000 42.2404 68.3583
frequency: 32.6000 42.2404 68.3581 76.1827 84.0908 90.2857 168.1091 205.4087 207.4694 227.1504 294.0241 370.8565 389.1410 406.3394 411.3618 439.9238 474.4283 480.1973 520.8928 538.9155 597.1201 601.9341 604.3465 619.7402 639.3036 655.8425 705.0152 707.5044 754.4052 765.0069 798.1814 810.4022 890.5056 909.1122 959.6955 961.2020 988.9167 992.4098 1023.8029 1024.3000 1026.7544 1026.8140 1041.4943 1124.8473 1125.8271 1158.5785 1161.9285 1249.5993 1278.0515 1309.5182 1319.1540 1325.8674 1333.4119 1334.3247 1357.9294 1383.8221 1450.2993 1478.1875 1532.1238 1559.2147 1584.7536 1590.8375 1639.5449 1641.8387 3160.2838 3160.4263 3163.7830 3163.9461 3186.3892 3186.9386 3529.6382 3529.7391
redmass: 8.1127 8.6838 7.7954 8.2377 5.4032 7.1913 7.4422 6.2012 10.8248 6.1739 5.5036 8.3215 2.9980 3.7088 8.2834 3.8824 5.1960 7.1275 6.7291 2.4010 1.2180 5.1011 1.2868 7.5333 7.8963 4.8609 5.7105 4.7746 6.7750 3.9428 7.0463 5.2615 1.4267 1.5278 1.4478 1.4817 4.4305 5.1860 1.3494 3.6635 1.3566 3.0497 3.7009 1.3048 1.4181 1.7119 1.7336 1.8618 1.8558 3.9448 2.7296 2.5184 2.9058 4.1999 2.4233 3.7135 2.6234 3.6278 6.3636 6.8888 5.9814 6.2531 8.9394 8.9467 1.0909 1.0909 1.0928 1.0929 1.0962 1.0965 1.0642 1.0643
irintensity: 0.0773 0.2061 0.0000 0.0310 6.4245 0.0000 0.0000 0.0103 0.0000 8.8384 0.0002 37.0705 22.8854 0.0001 0.0002 16.6776 0.0001 32.7088 0.0003 0.0002 243.7972 67.0996 0.0136 0.0003 16.8570 0.0000 88.5768 0.0003 19.8238 39.2641 0.0000 0.0001 65.1467 0.0003 11.8496 0.0000 0.0001 183.7201 0.0093 405.4062 0.1336 0.0007 129.3583 0.0000 7.3663 231.5235 0.0001 0.7218 0.0000 0.0001 0.0001 368.6385 0.0001 20.6622 47.7521 0.0002 64.8671 0.0000 29.7406 0.0000 0.0000 246.2462 742.2832 0.0001 0.0024 2.1162 7.1818 0.0001 1.4378 0.0001 128.9290 0.0014
temp: 298.150 k
press: 1.00000 atm
elementType: 8 8 8 8 7 7 6 6 6 6 6 6 6 6 6 6 6 6 1 1 1 1 1 1 1 1
symmnumber: 1
zpe: 476428.3 jmol-1
zpe.correction: 0.181462 hartree
zpe.thermalcorrener: 0.196298 hartree
zpe.thermalcorrenthalpy: 0.197242 hartree
zpe.thermalcorrgfe: 0.137726 hartree
zpe.sumelectzpe: -871.247185 hartree
zpe.sumelectthermal: -871.232349 hartree
zpe.sumelectthermalent: -871.231405 hartree
zpe.sumelectthermalfe: -871.290921 hartree
dipole: 0.0000 0.0000 0.0034
dipole: 0.0034
quadrupole: -91.8452 -103.0436 -103.7934
quadrupole: 18.3460 -0.0001 -0.0001
quadrupole: 7.7155 -3.4829 -4.2326 18.3460 -0.0001 -0.0001
hfenergy: -871.4286472 hartree
pointgroup: C01 [X(C12H8N2O4)]
dipole: 0.0000006 0.0000016 0.0013325 debye
dipolederiv: -0.8286523 -0.4340989 0.0006402 -0.7251934 -0.9841726 0.0010158 0.0007943 0.000681 -0.4239408 -0.8286519 -0.4340989 -0.000644 -0.7251932 -0.9841718 -0.0010219 -0.0008038 -0.0006908 -0.4239409 -1.1720735 0.2827859 0.0001169 0.2706782 -0.7934238 0.0002832 -0.0002522 0.0005979 -0.3279734 -1.1720732 0.2827858 -0.000119 0.2706786 -0.7934239 -0.0002865 0.0002432 -0.0005942 -0.327973 -0.6585329 -0.105011 0.0002837 -0.1562971 -0.3283601 0.0002339 0.0014038 0.0003054 -0.2308388 -0.6585337 -0.1050111 -0.0002862 -0.1562974 -0.3283599 -0.000235 -0.0014071 -0.0003064 -0.2308388 0.6616345 0.0090988 -0.0005154 -0.1369323 0.1780679 -0.0002348 0.0009959 -0.000479 0.0505823 0.6616359 0.0090991 0.0005181 -0.1369322 0.1780681 0.0002347 -0.0009928 0.0004794 0.0505823 -0.6149844 0.1833911 -0.0002043 0.3133725 -0.0710828 -0.0002076 -0.0003568 0.0001376 -0.0856082 -0.6149852 0.1833907 0.0002025 0.3133728 -0.0710832 0.0002089 0.0003547 -0.0001366 -0.0856083 -1.0263531 0.0320941 0.0002976 -0.2858402 -0.1670456 0.0005087 0.0013404 0.000252 0.0471419 -1.0263543 0.0320945 -0.0003039 -0.2858405 -0.1670462 -0.0005106 -0.0013449 -0.0002526 0.0471419 0.4657425 -0.1438076 -0.0000382 0.1796398 0.1153958 -0.0005633 -0.0003986 -0.0003604 -0.08502 0.4657438 -0.1438085 0.0000401 0.1796401 0.1153968 0.0005647 0.0004037 0.00036 -0.0850197 0.250401 0.0679544 -0.000181 0.1742645 0.2445917 -0.0005455 -0.0010378 -0.0003092 -0.0241987 0.2504017 0.0679541 0.0001826 0.174264 0.2445917 0.000547 0.0010425 0.0003106 -0.0241984 2.4173498 0.0637203 -0.0010639 0.2911686 1.4044078 -0.001299 -0.0011459 -0.0013701 0.2402894 2.41735 0.0637201 0.0010765 0.2911682 1.4044076 0.0013081 0.0011645 0.0013764 0.2402893 0.1495625 -0.0601077 0.0003089 -0.0720811 0.0402642 0.0002726 0.0002233 0.0001438 0.156311 0.1495623 -0.0601074 -0.0003091 -0.072081 0.0402644 -0.0002732 -0.0002241 -0.0001443 0.1563111 0.0821256 0.0692186 -0.0001388 0.0458326 0.0365843 0.0001899 -0.0000841 0.0001793 0.146156 0.0821254 0.0692191 0.0001388 0.0458329 0.0365837 -0.0001901 0.0000841 -0.0001792 0.1461558 0.0643995 -0.0435321 0.0001151 -0.0835478 0.020546 0.0002633 -0.0000101 0.0001145 0.1319229 0.0643997 -0.0435322 -0.0001154 -0.0835476 0.020546 -0.0002639 0.0000092 -0.000115 0.1319229 0.2093802 0.0782945 0.0000296 0.1849355 0.3042271 0.0000061 -0.0000226 0.0000802 0.4051763 0.2093801 0.0782946 -0.0000313 0.1849354 0.3042267 -0.0000056 0.0000212 -0.0000801 0.4051761 unknown
polarizability: 331.9414544|-3.2011784|150.5622407|0.0006965|0.0001236|59.5949945 unknown
InChI: InChI=1S/C12H8N2O4/c15-11(16)7-1-3-9(13-5-7)10-4-2-8(6-14-10)12(17)18/h1-6,15,17H
charge 0 multiplicity 1
26 atoms
O  5.546333 1.267023 -0.022757
O  -5.546325 -1.267024 -0.022793
O  5.738089 -1.049888 -0.020028
O  -5.738081 1.049888 -0.020057
N  1.402697 1.183045 -0.020908
N  -1.402689 -1.183045 -0.020917
C  0.743811 -0.024927 -0.01767
C  -0.743803 0.024927 -0.017673
C  1.430577 -1.268967 -0.016355
C  -1.430569 1.268967 -0.016358
C  3.524499 -0.028303 -0.020089
C  -3.524491 0.028303 -0.020103
C  2.835645 -1.269039 -0.017302
C  -2.835637 1.269038 -0.01731
C  2.759637 1.169642 -0.022064
C  -2.759629 -1.169642 -0.022078
C  5.009843 -0.028446 -0.021274
C  -5.009835 0.028446 -0.021293
H  0.841778 -2.189034 -0.014716
H  -0.841771 2.189034 -0.014714
H  3.412307 -2.199369 -0.015836
H  -3.4123 2.199369 -0.015844
H  3.261718 2.141431 -0.02384
H  -3.26171 -2.141431 -0.023859
H  6.539343 1.206531 -0.023157
H  -6.539335 -1.206531 -0.023204
