program: Gaussian 09
title: 000192727
version: EM64L-G09RevD.01
frameworkgroup: C1[X(C5H6O2)]
method: RPBEPBE
basis: SDD
operation: Freq
keyword: #p
keyword: freq=noraman
keyword: PBEPBE/SDD
title: #p freq=noraman PBEPBE/SDD
converged: YES YES NO NO
title: Mulliken charges:
elementType: O O C C C C C H H H H H H
charge: -0.189490 -0.204239 -0.502364 -0.109447 -0.232802 -0.047861 -0.099850 0.259664 0.259698 0.259020 0.259177 0.181358 0.167135
chargesum: 0.00000
title: Mulliken charges with hydrogens summed into heavy atoms:
elementType: O O C C C C C
charge: -0.189490 -0.204239 0.016998 0.149573 0.026375 0.133497 0.067285
polarizability: 9.65427101e+01 -1.12723522e-01 5.56136515e+01 1.51501006e-02 -1.12007388e-02 2.96615382e+01
1716.lowfreq: -18.8535 -7.0930 -0.0008 -0.0005 -0.0005 8.6527 13.3383 112.0837 129.7244
frequency: -15.1132 112.0804 129.7216 139.0710 251.1524 295.0706 409.3725 514.8827 654.0479 712.2263 836.9822 897.3850 978.7796 993.1967 1029.4488 1095.9791 1131.5394 1180.3339 1213.5375 1280.4528 1314.0955 1377.7983 1384.2811 1402.7507 1605.7107 1648.6584 1658.1381 2872.9526 2891.7263 2958.4374 2994.7853 3093.0857 3122.8737
redmass: 2.2309 6.8456 2.8641 2.5493 7.5428 2.0694 4.0126 5.6224 1.3139 4.7294 1.3831 2.9910 1.7869 1.3171 1.4666 2.5978 3.4270 1.1958 1.3148 1.3561 1.6752 1.2043 1.2481 1.0972 7.9963 7.5658 5.9581 1.0855 1.0854 1.0631 1.0951 1.0907 1.0922
irintensity: 6.6540 10.3439 2.7233 4.9546 6.0855 14.1266 5.3763 20.8195 7.5727 4.0671 1.5318 28.9528 1.4762 34.0208 32.3119 5.5586 102.4219 0.7838 14.4342 4.0367 7.2705 8.1820 8.6837 36.8839 155.9437 156.3946 72.0905 99.7912 132.1335 20.3523 3.6569 10.3495 9.2766
temp: 298.150 k
press: 1.00000 atm
elementType: 8 8 6 6 6 6 6 1 1 1 1 1 1
symmnumber: 1
zpe: 252295.7 jmol-1
zpe.correction: 0.096094 hartree
zpe.thermalcorrener: 0.103015 hartree
zpe.thermalcorrenthalpy: 0.103959 hartree
zpe.thermalcorrgfe: 0.064539 hartree
zpe.sumelectzpe: -343.999112 hartree
zpe.sumelectthermal: -343.992191 hartree
zpe.sumelectthermalent: -343.991247 hartree
zpe.sumelectthermalfe: -344.030668 hartree
dipole: 3.5622 2.8016 0.0024
dipole: 4.5319
quadrupole: -59.1707 -39.1082 -40.8240
quadrupole: 8.8031 0.0064 -0.0096
quadrupole: -12.8031 7.2594 5.5436 8.8031 0.0064 -0.0096
hfenergy: -344.0952065 hartree
pointgroup: C01 [X(C5H6O2)]
dipole: -1.4348096 -0.901523 -0.5546668 debye
dipolederiv: -0.5705574 0.0543679 0.0310998 0.2291158 -0.6584543 -0.2187774 0.1365737 -0.2193647 -0.4270961 -1.1209301 -0.0124781 -0.0119281 0.0731766 -0.4120635 -0.0394278 0.0389212 -0.0397208 -0.370619 -0.3627613 0.1284906 0.0743642 0.1058931 -0.1736924 -0.1922789 0.0614543 -0.1925635 0.0285734 0.4438899 0.1019177 0.0651842 0.1344917 0.0308246 0.1085566 0.0855811 0.1082573 -0.0797364 -0.7916649 -0.1487837 -0.0942733 -0.2755012 -0.0307538 0.0853261 -0.1709552 0.0863543 -0.1227406 1.0851911 -0.147229 -0.0821808 -0.2698612 0.7321848 0.3965438 -0.1564706 0.397246 0.3144299 1.4232008 0.0160241 0.0173906 0.2966706 0.5629121 0.2662875 0.1883345 0.2644533 0.290615 -0.0314249 -0.0157572 0.014644 -0.0560224 -0.0173394 0.059839 0.0096994 0.0781772 0.123519 -0.0309865 0.0071408 -0.0204983 -0.0159122 0.1500116 -0.0091034 -0.0543351 -0.0269743 -0.0443646 0.1391391 -0.002044 -0.0014238 -0.0688553 0.0172139 -0.0967476 -0.041917 -0.096192 0.1166247 0.0630087 0.0012329 0.0000756 -0.0153784 -0.0154016 -0.1147233 -0.0098999 -0.114537 0.1033425 -0.2509009 -0.0998202 -0.0629308 -0.145076 -0.0346259 -0.0853416 -0.090777 -0.0852455 0.0523137 0.0047964 0.1169382 0.0704766 0.0072589 -0.1508161 -0.1601529 0.0037907 -0.1598902 0.0151384 unknown
polarizability: 96.4947646|-1.365536|48.6752819|-0.4003009|11.5232028|36.6478533 unknown
InChI: InChI=1S/C5H6O2/c6-4-2-1-3-5-7/h1-2,4-5H,3H2
charge 0 multiplicity 1
13 atoms
O  -2.75402 0.912716 0.75579
O  3.494058 -0.100142 0.184904
C  -1.39249 -0.845582 -0.298837
C  -0.141493 -0.127113 0.145282
C  1.131905 -0.548524 -0.103694
C  -2.690126 -0.157674 0.109282
C  2.291651 0.229175 0.375517
H  -1.4239 -1.883667 0.097966
H  -1.413835 -0.973513 -1.403044
H  -0.307169 0.803687 0.710416
H  1.351168 -1.46867 -0.661903
H  -3.619323 -0.687981 -0.219491
H  2.030175 1.160089 0.941815
