program: Gaussian 09
title: 000192720
version: EM64L-G09RevD.01
frameworkgroup: C1[X(C7H14N2)]
method: RPBEPBE
basis: SDD
operation: Freq
keyword: #pfreq=noraman
keyword: PBEPBE/SDD
title: #p freq=noraman PBEPBE/SDD
converged: NO YES NO NO
title: Mulliken charges:
elementType: N N C C C C C C C H H H H H H H H H H H H H H
charge: -0.321917 -0.209297 -0.055678 -0.055678 -0.475072 -0.443237 -0.443238 -0.494939 -0.494937 0.188942 0.188942 0.215562 0.206613 0.186133 0.213717 0.213717 0.186133 0.213261 0.206564 0.206563 0.213261 0.267362 0.287224
chargesum: 0.00000
title: Mulliken charges with hydrogens summed into heavy atoms:
elementType: N N C C C C C C C
charge: -0.054556 0.077928 0.133264 0.133264 -0.052898 -0.043388 -0.043388 -0.075114 -0.075112
polarizability: 8.21075070e+01 3.42993974e-04 8.70177841e+01 -1.53403632e+00 8.62496255e-05 7.73991198e+01
1716.lowfreq: -21.4722 -14.5006 -0.0005 -0.0003 0.0004 7.0321 172.5910 247.6001 255.8155
frequency: 172.5665 247.6000 255.8123 334.3889 376.8988 384.5881 389.5778 468.5927 509.7565 661.1201 662.5407 723.0481 772.0914 777.4875 847.7615 872.8991 892.6817 925.0700 929.2437 944.8967 959.2292 1001.2472 1041.2360 1074.7161 1086.4916 1103.0296 1114.6775 1134.5315 1169.2451 1175.7927 1210.6692 1232.6882 1280.9905 1285.2404 1286.7838 1304.0572 1324.8081 1345.9430 1347.2944 1348.1809 1358.5266 1382.3141 1442.5884 1451.3542 1452.1400 1466.1125 1467.2218 1480.3396 1499.5079 2838.0183 2844.3369 2958.2685 2959.0527 2960.8090 2986.2424 2992.9307 3008.8101 3011.7856 3022.6545 3032.7022 3035.7984 3394.3860 3434.4371
redmass: 2.4220 2.8150 2.4834 1.8828 3.5351 1.9772 1.8362 3.3533 1.8189 4.9010 1.6328 2.9636 2.9612 2.5492 2.4148 2.0240 1.5231 1.6849 2.2651 2.1114 1.8350 2.4690 2.1371 1.3735 1.9802 1.9294 1.7493 1.4984 1.1542 1.6021 1.3438 1.2301 1.4573 1.5487 1.5062 1.5901 1.2695 1.4973 1.4610 1.3632 1.3298 1.4020 1.2454 1.0952 1.1471 1.0929 1.0754 1.0915 1.1241 1.0718 1.0701 1.0641 1.0630 1.0633 1.0836 1.0834 1.0877 1.0904 1.1013 1.1005 1.1004 1.0727 1.0749
irintensity: 0.4850 7.9310 4.4732 0.0001 1.5888 0.7697 11.8560 5.5008 30.7918 0.0000 25.0940 123.8682 0.0016 96.0894 5.3072 0.1229 0.8755 47.5393 14.2300 0.9100 0.3089 8.4859 0.0500 6.1633 1.7976 17.8817 0.8963 6.0398 6.1640 12.8448 10.9130 8.6413 19.6085 0.0025 4.8555 0.5032 7.3908 3.3484 1.6067 0.0439 0.9123 0.3126 8.0084 7.3311 1.4402 14.0622 4.1580 6.5052 5.7011 59.5032 190.1460 23.3589 26.6697 70.1152 118.8643 106.9735 77.1794 12.0343 42.4373 45.9659 57.2303 6.6390 2.5219
temp: 298.150 k
press: 1.00000 atm
elementType: 7 7 6 6 6 6 6 6 6 1 1 1 1 1 1 1 1 1 1 1 1 1 1
symmnumber: 1
zpe: 547027.2 jmol-1
zpe.correction: 0.208352 hartree
zpe.thermalcorrener: 0.215881 hartree
zpe.thermalcorrenthalpy: 0.216825 hartree
zpe.thermalcorrgfe: 0.177078 hartree
zpe.sumelectzpe: -383.890236 hartree
zpe.sumelectthermal: -383.882707 hartree
zpe.sumelectthermalent: -383.881763 hartree
zpe.sumelectthermalfe: -383.921510 hartree
dipole: 2.5754 -0.0001 1.0320
dipole: 2.7745
quadrupole: -58.5249 -53.1228 -56.9324
quadrupole: 0.0003 -5.3765 0.0003
quadrupole: -2.3315 3.0706 -0.7390 0.0003 -5.3765 0.0003
hfenergy: -384.0985874 hartree
pointgroup: C01 [X(C7H14N2)]
dipole: -1.0183361 0.0002394 0.3930546 debye
dipolederiv: -0.3273188 -0.0000631 0.131048 -0.0000666 -0.5344903 -0.0000344 0.1782523 -0.000045 -0.5452301 -0.5774903 -0.0000051 0.3119239 0.0000004 -0.5001394 -0.0000811 0.2283554 -0.0000602 -0.4850458 -0.0376202 0.0205814 0.0467582 0.0063192 0.0883565 0.0375546 0.061615 -0.018558 0.00258 -0.0376369 -0.0205254 0.0467395 -0.0062669 0.0883725 -0.0375656 0.0616296 0.0185394 0.002575 0.0772934 -0.0000261 -0.0055263 -0.0000252 -0.0217735 -0.0000079 -0.0089216 -0.0000071 0.1095045 0.2494751 0.0198833 -0.0816776 -0.0457126 0.4013807 0.1464732 -0.1218288 0.1706114 0.3005242 0.2494916 -0.0197932 -0.0817602 0.0458078 0.4014086 -0.1464163 -0.1219131 -0.1705349 0.3004794 0.3274121 0.086825 -0.0383198 -0.0046456 0.3584237 0.111349 -0.0741081 0.1424885 0.2741587 0.3273704 -0.0868012 -0.0383937 0.0046762 0.358507 -0.1113198 -0.0741832 -0.1424407 0.2741245 0.0293039 0.0192771 0.0102979 0.0041387 -0.1742728 -0.1268074 0.0016218 -0.1454312 -0.034241 0.0292924 -0.0193801 0.0103575 -0.0042414 -0.1742989 0.1267824 0.0016937 0.1454105 -0.0342027 -0.1085135 0.0000496 -0.1800797 0.0000452 0.0352812 0.0000511 -0.1161304 0.0000347 -0.0330291 -0.11069 0.0000225 0.1926255 0.0000276 0.0291138 -0.0000442 0.1199182 -0.0000252 -0.0485232 -0.187473 0.0806667 0.1440675 -0.0100084 -0.0244479 -0.0330202 0.168559 -0.1474751 -0.1137426 0.0743464 -0.0038485 0.0020691 0.0325665 -0.1382241 0.0938113 -0.0443214 0.1357508 -0.0533579 0.0743316 0.0037392 0.0020226 -0.0326707 -0.1381795 -0.0938242 -0.0443945 -0.1357393 -0.0533877 -0.1875124 -0.0806034 0.1440747 0.01007 -0.0244346 0.0329572 0.1686366 0.1473994 -0.1137171 0.0679455 0.0388511 0.0098102 -0.0232033 -0.1363369 0.1032728 0.0443383 0.1405257 -0.0434549 -0.1355641 -0.0460078 -0.1012714 0.0131148 0.0539926 -0.0156408 -0.1279865 -0.0937564 -0.0575757 -0.1355475 0.0461209 -0.1012554 -0.0129973 0.0539586 0.01571 -0.12794 0.0938397 -0.0575596 0.0679378 -0.03896 0.0097508 0.0230895 -0.136291 -0.1032913 0.0442683 -0.1405619 -0.0434912 0.0101645 0.0000329 -0.2162144 0.0000247 0.0810785 0.0000466 -0.0974914 0.0000164 0.2239796 0.2610019 -0.000036 -0.2170468 -0.0000425 0.0530154 0.0000448 -0.1196694 0.0000185 0.2286327 unknown
polarizability: 82.0676124|0.0012821|87.0177837|1.5935863|0.0002594|77.4390148 unknown
InChI: InChI=1S/C7H14N2/c1-6-2-8-4-7(1)5-9-3-6/h6-9H,1-5H2
charge 0 multiplicity 1
23 atoms
N  -1.421161 0.000428 -0.99132
N  1.480751 -0.000301 -1.025588
C  -0.007812 1.252148 0.650128
C  -0.008462 -1.252232 0.649952
C  -0.003156 -0.000108 1.564639
C  -1.312593 1.248878 -0.187889
C  -1.313242 -1.248183 -0.188055
C  1.289044 1.23631 -0.221149
C  1.288397 -1.236933 -0.221336
H  -0.00511 2.173987 1.267447
H  -0.006219 -2.174159 1.267142
H  0.895657 -0.000385 2.212627
H  -0.89065 0.000074 2.229994
H  -2.174069 1.375516 0.517636
H  -1.323603 2.110072 -0.88385
H  -1.324692 -2.109279 -0.88413
H  -2.174786 -1.374469 0.517449
H  1.294815 2.098289 -0.915267
H  2.160458 1.354386 0.45592
H  2.159752 -1.355563 0.455714
H  1.293718 -2.098809 -0.915585
H  -2.259919 0.000686 -1.587681
H  0.769579 -0.000055 -1.774299
