program: Gaussian 09
title: 000192697
version: EM64L-G09RevD.01
frameworkgroup: C1[X(C16H24N4O3S)]
method: RPBEPBE
basis: SDD
operation: Freq
keyword: #p
keyword: freq=noraman
keyword: PBEPBE/SDD
title: #p freq=noraman PBEPBE/SDD
converged: YES YES NO NO
title: Mulliken charges:
elementType: S O O O N N N N C C C C C C C C C C C C C C C C H H H H H H H H H H H H H H H H H H H H H H H H
charge: 0.961742 -0.561825 -0.508927 -0.504695 -0.102728 -0.396556 -0.546707 -0.546457 -0.368739 -0.445097 -0.347065 -0.354894 0.310435 0.231628 0.507477 -0.401578 -0.402401 -0.267500 -0.398034 -0.363335 -0.439480 -0.251565 -0.280472 -0.274232 0.233862 0.211113 0.245877 0.221037 0.192741 0.188560 0.189549 0.201441 0.293438 0.205863 0.223048 0.225991 0.200639 0.228477 0.200329 0.277729 0.226010 0.299147 0.243791 0.266546 0.265124 0.267744 0.264179 0.378770
chargesum: 0.00000
title: Mulliken charges with hydrogens summed into heavy atoms:
elementType: S O O O N N N N C C C C C C C C C C C C C C C C
charge: 0.961742 -0.183055 -0.508927 -0.504695 -0.102728 -0.103117 -0.015037 -0.014533 0.076235 0.021817 0.034235 0.036096 0.310435 0.231628 0.507477 0.027332 0.024229 -0.267500 -0.169556 -0.163006 -0.161751 -0.025554 0.018674 -0.030440
polarizability: 3.60986111e+02 5.84991547e+00 2.53191987e+02 -1.06829808e+01 2.00826498e+01 1.58328028e+02
1716.lowfreq: -3.3690 -0.0012 -0.0010 0.0014 3.1823 11.2412 17.9445 19.1221 21.7598
frequency: 17.5838 18.8605 21.7550 41.5602 45.3518 52.1702 63.0668 70.9768 83.5957 96.7300 110.7010 131.8530 150.8302 158.5526 180.0753 192.8205 207.0064 218.1936 221.1557 233.5038 250.7398 263.3717 263.7896 271.9769 293.1012 313.8022 324.8802 329.2847 345.8196 358.0953 385.3089 389.1487 417.3149 467.9285 471.1604 483.0316 500.0114 508.6158 512.4354 541.1681 548.8298 551.4603 571.8956 574.8840 630.2055 659.3803 728.3752 742.6142 757.9721 761.3574 776.2075 783.6681 792.5205 822.2122 833.2755 845.1171 855.6714 866.8599 919.3000 947.7518 949.9484 955.3691 973.1356 975.5445 992.4499 1012.3583 1020.9381 1027.5483 1050.1617 1054.6894 1079.0940 1080.3097 1092.9323 1097.7678 1098.4292 1118.6665 1137.6306 1170.6957 1188.0620 1200.4889 1201.9298 1226.3274 1248.3199 1265.5412 1280.7402 1284.9585 1293.9942 1311.0500 1314.4033 1316.8427 1324.3514 1329.2961 1335.8453 1350.3996 1363.3695 1367.4126 1378.3045 1381.1315 1402.9083 1443.0449 1450.1007 1455.1296 1458.3340 1467.5008 1470.9717 1475.2302 1482.7122 1489.6009 1535.1722 1586.3340 1588.9021 1624.2143 1642.9216 1643.2787 2855.0945 2863.8471 2903.6469 2989.4057 2992.9394 2994.4441 3003.6593 3021.6392 3034.5159 3059.7150 3061.1028 3068.0259 3127.0223 3137.6434 3154.0142 3164.6537 3172.4958 3186.8146 3468.7842 3471.2284 3476.9294 3595.9670 3598.6223 3599.2641
redmass: 5.2487 5.6185 5.7232 5.8440 5.5948 4.3980 3.5953 4.1701 1.7396 1.8287 4.1405 5.9496 2.9238 1.7643 3.7577 4.0103 2.6902 2.9392 2.6084 3.7027 4.4498 1.1694 1.2615 2.2645 3.4887 7.4369 2.9890 4.3640 2.2700 1.9299 3.1101 3.5245 9.9705 4.7872 3.3218 5.3240 3.0953 2.5432 4.2252 3.5784 2.1125 2.4374 4.5510 2.9819 3.8555 4.5587 1.4151 3.7069 1.1363 1.1398 4.2344 1.3426 1.4889 4.1040 7.7645 4.5688 4.3449 1.5471 1.3786 1.2841 1.2500 12.3162 1.3568 1.3651 5.3574 3.4337 3.9259 3.8570 1.1887 2.4512 2.3166 2.1434 2.6497 3.4919 2.5819 2.3811 1.8752 1.5539 1.4454 1.4300 1.4220 2.0906 1.5186 1.7922 1.1869 1.2189 1.1625 1.2671 1.4826 1.2309 1.2611 1.3501 1.4144 2.3100 1.3157 1.3096 1.3349 5.0986 2.3165 3.1467 1.9603 1.0867 1.0906 1.0990 1.1233 1.1136 1.2312 1.8841 2.7262 5.9961 5.2785 6.4046 1.0915 1.0912 1.0702 1.0699 1.0696 1.0636 1.0665 1.0633 1.0835 1.0869 1.0892 1.1036 1.1035 1.1023 1.0872 1.0875 1.0904 1.0928 1.0986 1.0961 1.0445 1.0445 1.0661 1.0983 1.0984 1.0761
irintensity: 0.1673 1.2515 1.2131 0.1430 1.2074 1.0449 0.3683 0.0954 2.4327 1.8930 1.2284 0.8530 32.1100 34.2878 1.5297 3.0145 13.5333 8.0593 4.8732 22.7199 3.9759 45.5959 30.4113 35.7764 0.4164 19.0939 7.8602 13.9298 36.0255 31.5289 35.3969 10.0299 80.3058 11.7929 1.4213 30.6737 65.6096 97.9494 65.0025 259.0802 273.7742 122.1733 79.8817 7.8186 17.9814 2.8051 1.6975 4.7935 2.0384 4.7496 5.9696 127.0198 9.1732 6.4625 79.7985 2.7403 2.4578 6.0306 1.6900 3.6817 0.8046 95.2426 1.2596 1.7082 0.3730 22.6112 16.5574 2.6425 76.6621 34.5652 26.3109 42.2981 21.8059 27.1904 6.4450 1.0138 32.9688 7.6155 28.1142 1.6562 3.4127 25.4187 20.1066 8.8234 11.7048 20.5634 1.1749 8.5503 45.4539 1.9696 8.9850 13.6566 5.9228 7.0721 0.2055 0.3067 12.6286 179.8807 11.4673 39.6419 39.9898 1.6534 3.3584 5.5905 10.1717 17.2144 21.0374 58.7072 93.8003 301.8769 29.6144 14.3755 35.1185 34.6086 48.7649 127.0301 81.5759 37.1082 19.7776 60.0559 47.8360 33.3172 17.0472 47.3037 68.4619 33.6127 12.5990 15.1654 7.8243 25.7791 15.9516 6.3590 0.9237 1.1553 42.0152 0.7690 0.8697 25.2801
temp: 298.150 k
press: 1.00000 atm
elementType: 16 8 8 8 7 7 7 7 6 6 6 6 6 6 6 6 6 6 6 6 6 6 6 6 1 1 1 1 1 1 1 1 1 1 1 1 1 1 1 1 1 1 1 1 1 1 1 1
symmnumber: 1
zpe: 1017095.9 jmol-1
zpe.correction: 0.387391 hartree
zpe.thermalcorrener: 0.414165 hartree
zpe.thermalcorrenthalpy: 0.415109 hartree
zpe.thermalcorrgfe: 0.327670 hartree
zpe.sumelectzpe: -1464.799590 hartree
zpe.sumelectthermal: -1464.772817 hartree
zpe.sumelectthermalent: -1464.771873 hartree
zpe.sumelectthermalfe: -1464.859311 hartree
dipole: 6.0179 -0.7187 -0.3436
dipole: 6.0704
quadrupole: -184.1283 -141.3064 -159.0643
quadrupole: 1.8697 26.7526 4.0651
quadrupole: -22.6286 20.1933 2.4354 1.8697 26.7526 4.0651
hfenergy: -1465.1869817 hartree
pointgroup: C01[X(C16H24N4O3S1)]
dipole: -2.3665561 0.2641812 -0.1829566 debye
polarizability: 360.5032927|7.212693|251.9215564|13.9401385|-22.8301259|160.0812774 unknown
InChI: InChI=1S/C16H24N4O3S/c17-7-10-20(11-8-18)12-9-19-15-5-1-4-14-13(15)3-2-6-16(14)24(21,22)23/h1-6,19,21H,7-12,17-18H2
charge 0 multiplicity 1
48 atoms
S  5.467274 -0.282524 0.695861
O  5.623819 -1.430381 -0.763099
O  6.709081 0.756202 0.683499
O  5.235346 -1.199911 2.011239
N  -4.431946 -0.023829 0.173519
N  -0.88986 0.936688 -0.883211
N  -5.777418 -3.561623 -0.563435
N  -6.911111 2.824688 0.952717
C  -3.064661 0.513872 0.343665
C  -2.270456 0.448835 -0.990795
C  -4.529497 -1.500242 0.277996
C  -5.476299 0.713657 0.92466
C  0.186474 0.186646 -0.417759
C  1.525437 0.76927 -0.392555
C  2.639656 -0.040683 0.09282
C  -5.611146 -2.102449 -0.665256
C  -5.9028 2.036458 0.224488
C  3.917536 0.60791 0.087131
C  0.019097 -1.14485 0.02375
C  1.781151 2.104575 -0.835951
C  2.41901 -1.383477 0.527687
C  1.124442 -1.907138 0.481075
C  4.163265 1.906323 -0.342698
C  3.059523 2.670469 -0.814362
H  -2.495483 -0.01631 1.143321
H  -3.129825 1.572181 0.656548
H  -2.806134 1.060339 -1.738267
H  -2.269795 -0.587502 -1.379653
H  -4.737153 -1.832002 1.326895
H  -3.551177 -1.94207 0.002224
H  -5.154451 0.94529 1.971874
H  -6.3707 0.06728 1.009133
H  -0.727249 1.903047 -1.154348
H  -6.588468 -1.625729 -0.459153
H  -5.352971 -1.839514 -1.707348
H  -6.293796 1.790339 -0.779478
H  -5.012628 2.675228 0.064128
H  -0.973839 -1.602331 0.02559
H  0.965415 2.730685 -1.214731
H  3.248928 -1.984456 0.903596
H  0.949342 -2.935823 0.815042
H  5.177046 2.317667 -0.31228
H  3.2200 3.695076 -1.161884
H  -4.983618 -4.11329 -0.899597
H  -6.132869 -3.897022 0.335928
H  -7.841476 2.400006 0.995656
H  -6.605913 3.184317 1.861425
H  6.382099 -2.053591 -0.562803
