program: Gaussian 09
title: 000192695
version: EM64L-G09RevD.01
frameworkgroup: C1[X(C7H14N2O2)]
method: RPBEPBE
basis: SDD
operation: Freq
keyword: #p
keyword: freq=noraman
keyword: PBEPBE/SDD
title: #p freq=noraman PBEPBE/SDD
converged: NO YES NO NO
title: Mulliken charges:
elementType: O O N N C C C C C C C H H H H H H H H H H H H H H
charge: -0.283378 -0.328589 -0.378566 -0.378655 0.033003 -0.687479 -0.765985 0.223086 0.248710 -0.617085 -0.613716 0.216248 0.246487 0.235730 0.275218 0.198379 0.219628 0.360815 0.340030 0.224890 0.224413 0.268488 0.230329 0.228628 0.279371
chargesum: 0.00000
title: Mulliken charges with hydrogens summed into heavy atoms:
elementType: O O N N C C C C C C C
charge: -0.283378 -0.328589 -0.017751 -0.038624 0.033003 0.010985 -0.072759 0.223086 0.248710 0.100705 0.124612
polarizability: 1.13053264e+02 -3.60079884e+00 9.79341390e+01 4.17751120e+00 -5.40709841e+00 7.95014753e+01
1716.lowfreq: -4.9597 -0.0004 -0.0002 0.0008 10.0329 15.3332 34.3718 63.3974 86.5212
frequency: 34.3484 63.3275 86.4751 91.6819 136.6122 155.2314 182.0526 210.8642 234.9335 256.9660 277.8902 282.8006 329.4796 349.0039 352.1718 391.8340 423.8931 542.4122 606.4750 651.2623 705.7690 742.2892 794.8381 814.6469 841.9468 916.8949 953.3172 1005.2106 1030.2514 1044.7809 1118.9218 1119.9845 1136.0629 1144.3917 1156.9169 1180.1088 1201.5420 1234.9508 1260.8949 1375.9674 1400.0951 1414.5531 1417.1965 1454.7712 1462.4785 1467.3148 1470.3996 1478.4367 1486.3069 1488.5421 1494.8386 1522.1120 1537.1646 1583.1689 1629.1005 2975.9673 2980.1821 2983.6280 2986.2574 3053.2823 3064.2011 3070.6081 3082.7436 3106.9010 3107.3270 3109.8397 3117.1099 3352.4961 3568.6063
redmass: 4.0946 4.1561 1.0901 1.0763 3.3532 2.8614 3.1426 1.0565 3.0994 2.7015 2.6500 1.3127 2.9020 4.6031 3.0754 7.4598 3.8781 3.9257 1.1654 4.0689 4.3116 6.9271 3.3638 1.2422 2.1496 2.3595 1.5097 1.4252 3.1088 3.1723 1.3072 1.3107 1.7000 1.9275 2.4672 2.4022 2.8896 2.6464 2.3884 1.1790 1.2133 1.2018 1.1759 1.2067 1.0834 1.0677 1.0900 1.0584 1.0469 1.0451 1.0783 1.4960 1.8933 4.0307 5.5826 1.0350 1.0383 1.0349 1.0354 1.1017 1.1025 1.1009 1.0999 1.0986 1.0993 1.0967 1.0984 1.0815 1.0772
irintensity: 3.0536 9.7269 0.8151 0.2594 3.6375 0.7886 8.8048 0.0774 0.8350 4.8673 10.2114 0.6281 0.1615 40.0846 3.5137 5.8174 9.4601 6.5830 79.7412 4.1023 5.4506 1.0233 4.6591 103.6461 23.3714 6.7286 2.2724 6.5063 41.9302 4.9489 0.4503 0.0082 74.0047 18.7671 20.1454 12.5170 21.1265 30.1648 25.8623 25.3634 21.8470 55.3781 9.9243 85.7966 35.3104 2.1443 40.4892 24.3625 13.0354 15.5180 27.1340 192.4000 243.8622 26.4037 231.0145 86.5434 26.0089 61.7401 23.5503 36.3504 29.8949 27.9819 26.0114 6.2102 7.3824 14.5298 1.7270 208.8018 29.3649
temp: 298.150 k
press: 1.00000 atm
elementType: 8 8 7 7 6 6 6 6 6 6 6 1 1 1 1 1 1 1 1 1 1 1 1 1 1
symmnumber: 1
zpe: 552106.7 jmol-1
zpe.correction: 0.210286 hartree
zpe.thermalcorrener: 0.223693 hartree
zpe.thermalcorrenthalpy: 0.224637 hartree
zpe.thermalcorrgfe: 0.170334 hartree
zpe.sumelectzpe: -534.243261 hartree
zpe.sumelectthermal: -534.229854 hartree
zpe.sumelectthermalent: -534.228910 hartree
zpe.sumelectthermalfe: -534.283213 hartree
dipole: -3.4639 -0.0860 -0.0911
dipole: 3.4661
quadrupole: -60.4707 -67.3695 -68.7825
quadrupole: -9.0962 8.0765 4.3725
quadrupole: 5.0702 -1.8286 -3.2416 -9.0962 8.0765 4.3725
hfenergy: -534.4535472 hartree
pointgroup: C01 [X(C7H14N2O2)]
dipole: -1.3493729 -0.1241178 -0.1530028 debye
dipolederiv: -0.7923967 -0.152809 0.3396902 0.090523 -0.5519834 0.2118178 0.1509737 0.3035247 -0.7279186 -0.7850068 -0.1134371 -0.0406422 0.0563678 -0.5952372 0.3110198 -0.2916296 0.1757158 -0.859189 -0.7659043 0.2394093 -0.1890012 0.165396 -0.7357874 0.2553455 -0.0668993 0.2574142 -0.666406 -0.995486 -0.1183654 -0.3023774 -0.2034354 -0.4512672 -0.1173152 -0.2990496 -0.0678319 -0.5432172 -0.397589 -0.0182751 0.075209 -0.0164026 -0.0868719 0.0069167 0.1007723 -0.0805513 0.0609259 0.0011176 -0.0017182 -0.022729 -0.0363664 0.0636286 0.0150104 0.0015753 0.0792954 -0.0189864 -0.033808 -0.0637784 -0.0042413 -0.0838702 -0.0382652 0.0747713 0.0081832 0.0594946 -0.0521239 1.0342435 -0.1203704 -0.3210862 -0.407096 0.737888 -0.572949 -0.1031583 -0.6257326 0.8737184 1.1491891 0.3479665 0.4445931 0.3277092 0.487884 -0.2738761 0.6876197 -0.1762267 0.9346398 0.3713028 -0.224254 0.1936709 -0.0952924 0.2580563 0.0325728 0.0546531 0.099048 0.1469824 0.3737687 0.0693915 -0.0134961 0.1921795 0.2899869 0.1435683 -0.1880834 0.0377962 0.051908 -0.0918541 0.1390642 0.0165729 0.1119829 -0.0022963 -0.0331767 -0.0045961 -0.0209126 0.0813147 0.1009399 0.0181752 -0.0261307 0.0274289 0.0602437 0.0996481 -0.0309474 0.041033 -0.0698267 -0.0142419 -0.1286947 0.0175133 -0.1091377 -0.0138487 -0.0115483 0.0293386 0.0192739 0.0778681 0.0475175 -0.1377841 0.0549831 -0.0901648 0.0326662 0.0215965 0.0025332 0.0095928 0.1064425 -0.1197545 0.1414644 -0.0253584 0.1113153 0.0432106 -0.003634 0.0262679 -0.0147216 0.0582954 0.0951509 -0.0013092 -0.0447325 -0.0156133 -0.0120644 -0.1268128 -0.0440829 -0.0968612 -0.0639154 0.5309567 0.02766 0.058925 0.0507604 0.2450255 0.0478091 -0.0455952 0.0444629 0.2563697 0.2254037 -0.0246777 -0.0330155 -0.0458072 0.2275133 0.053972 -0.0078976 0.0677773 0.1890583 0.023261 0.0109187 -0.0530553 0.0731641 -0.1987307 -0.0185192 -0.0171223 -0.0558258 0.099841 -0.003264 0.0702204 -0.1045432 0.0275441 0.0691521 -0.0384575 -0.1509868 -0.006503 -0.1266158 0.0492734 -0.0007383 0.0231936 -0.0971101 0.1080303 0.0497455 0.1346194 0.0106191 0.0643988 0.0163472 -0.0344586 0.0102571 -0.1095071 -0.0319675 -0.1301112 -0.0190053 -0.1518437 -0.0302975 -0.1781892 0.0248016 -0.0001183 0.0857429 0.0039741 -0.0309075 0.0268582 -0.0075493 0.1281001 0.1590222 0.0515982 -0.054081 -0.0103108 0.0910603 0.0335139 0.0456592 0.0995117 0.0286335 unknown
polarizability: 111.6780766|1.062149|89.6821834|8.3804871|-10.2569476|89.1286188 unknown
InChI: InChI=1S/C7H14N2O2/c1-7(2,5(10)8-3)6(11)9-4/h8-9H,1-4H3
charge 0 multiplicity 1
25 atoms
O  2.33724 0.544272 -1.100071
O  -0.887647 -1.010348 1.294331
N  1.78712 -0.829868 0.703507
N  -2.070323 -0.462905 -0.621002
C  0.058551 0.762875 -0.144011
C  0.100596 1.793744 1.032741
C  -0.229105 1.503093 -1.469364
C  1.498935 0.124644 -0.240876
C  -0.998386 -0.308507 0.22746
C  3.10102 -1.473298 0.791979
C  -3.144321 -1.432227 -0.36735
H  -0.847606 2.360278 1.082179
H  0.252344 1.282951 1.997697
H  0.926742 2.508068 0.870236
H  0.599532 2.199042 -1.673095
H  -1.167573 2.086635 -1.406986
H  -0.26624 0.81466 -2.334201
H  1.008427 -1.124886 1.314901
H  -2.115891 0.113763 -1.461198
H  3.031813 -2.556597 0.578162
H  3.538925 -1.339935 1.798514
H  3.762952 -1.005282 0.045732
H  -3.203786 -2.180354 -1.179041
H  -4.12218 -0.925418 -0.273391
H  -2.912938 -1.945804 0.578746
