program: Gaussian 09
title: 000192669
version: EM64L-G09RevD.01
frameworkgroup: C1[X(C17H22N2O7)]
method: RPBEPBE
basis: SDD
operation: Freq
keyword: #p
keyword: freq=noraman
keyword: PBEPBE/SDD
title: #p freq=noraman PBEPBE/SDD
converged: YES YES NO NO
title: Mulliken charges:
elementType: O O O O O O O N N C C C C C C C C C C C C C C C C C H H H H H H H H H H H H H H H H H H H H H H
charge: -0.467249 -0.437885 -0.468890 -0.495862 -0.452956 -0.213279 -0.434501 -0.349071 -0.460727 -0.302371 -0.139776 0.192005 0.156617 -0.204361 -0.545223 -0.120577 0.160736 -0.194851 0.191379 -0.126411 0.162334 -0.430687 -0.372989 -0.296985 -0.256159 -0.223763 0.250652 0.279425 0.306525 0.221913 0.248775 0.279532 0.291119 0.330159 0.206956 0.252379 0.352155 0.232208 0.232500 0.339157 0.142244 0.213918 0.350662 0.218796 0.219870 0.414353 0.388428 0.359776
chargesum: 0.00000
title: Mulliken charges with hydrogens summed into heavy atoms:
elementType: O O O O O O O N N C C C C C C C C C C C C C C C C C
charge: -0.115094 -0.098728 -0.118227 -0.081510 -0.064528 -0.213279 -0.074725 -0.069539 -0.130569 -0.051720 0.139649 0.192005 0.156617 0.102164 -0.074534 0.170542 0.160736 0.012105 0.191379 0.125968 0.162334 -0.198479 -0.140489 0.059177 -0.037363 -0.003893
polarizability: 3.01689114e+02 -4.74646365e+00 2.24138163e+02 2.72623663e+01 5.46992183e+00 1.50654201e+02
1716.lowfreq: -5.0705 -0.0004 -0.0004 0.0003 5.1335 8.8980 19.3972 36.0996 41.8214
frequency: 19.2898 35.9654 41.7968 53.7767 63.1989 79.3301 85.6837 92.3737 104.7323 122.4790 142.9404 159.5253 164.1482 171.9370 212.6347 219.8581 229.7008 238.9320 258.4119 265.5834 278.4220 295.0311 312.6134 316.5191 324.2875 330.4740 376.1669 395.2644 432.5338 439.4667 468.9348 484.0541 507.5239 518.6437 535.2862 545.6386 568.7320 578.1086 583.5028 602.3423 606.8280 626.4926 629.9582 649.8804 659.4151 663.4593 693.5885 713.1258 723.8426 746.0370 748.6260 754.5875 761.6619 814.6122 829.9375 849.6141 866.2149 891.2035 905.2692 925.7738 929.9082 957.1503 968.8237 970.9188 975.7735 988.3452 1006.7328 1011.8035 1024.2617 1028.2729 1045.7658 1068.7260 1079.5437 1083.4003 1087.7639 1111.0901 1128.0698 1149.3953 1158.8621 1168.9841 1174.8441 1182.2258 1188.9149 1224.9006 1227.7064 1231.6944 1240.4077 1244.9496 1252.5213 1263.2954 1279.8998 1288.5305 1298.6435 1310.2379 1325.7825 1338.8876 1340.4699 1354.2931 1356.6777 1359.9067 1368.7101 1373.7797 1376.7902 1395.6900 1403.3180 1407.0856 1440.4376 1457.7645 1462.3123 1468.1106 1470.3636 1480.7396 1576.3395 1588.5193 1631.8237 1669.6960 2869.6103 2928.9772 2960.8353 2972.8787 3019.5166 3039.2963 3055.2366 3056.1138 3073.5690 3092.1993 3121.3979 3129.5598 3143.1478 3160.8292 3381.8648 3430.0140 3459.3956 3462.6637 3502.9142 3508.5927 3557.2081 3568.2169
redmass: 6.9102 6.5034 8.6439 4.6381 5.3797 5.4701 4.3907 5.8121 6.3028 6.0852 4.9085 5.1112 3.7974 4.6959 1.8008 5.2021 2.1583 4.4252 6.1930 5.2060 3.2145 2.8282 1.6862 4.5791 6.1980 3.9851 3.8574 3.6200 3.2007 4.7631 4.1534 3.0211 2.7445 3.1648 1.2111 3.7575 4.0566 4.0933 3.9794 2.4357 1.6461 2.2416 1.6674 1.3541 1.3347 2.2283 2.6558 2.9293 3.9482 2.3754 2.4614 3.0344 3.9181 3.6599 3.0145 1.5025 3.1795 4.6482 2.5113 3.0578 1.4452 3.8760 1.3029 4.9169 3.7318 4.1312 2.9419 2.1381 2.7511 3.4207 3.1157 2.1335 2.4071 3.1891 3.6756 1.8578 4.6909 2.1390 1.1245 1.2056 1.1537 1.2118 1.3313 1.3985 1.4397 1.7865 1.2915 1.5042 1.3473 1.4109 1.6154 1.3755 1.3121 1.4613 1.6242 1.3604 1.2943 1.3729 1.3787 1.4648 1.2288 1.6232 1.2800 1.2462 1.4891 3.6072 3.6138 1.1767 1.0986 2.8370 1.3928 3.0834 7.0684 6.5363 7.2607 8.1671 1.0712 1.0835 1.0835 1.0597 1.1000 1.0851 1.0903 1.0866 1.0865 1.0871 1.0847 1.0890 1.0952 1.1001 1.0673 1.0749 1.0644 1.0645 1.0637 1.0655 1.0661 1.0807
irintensity: 1.2607 1.2032 0.9897 0.8393 6.0052 2.1289 3.3519 3.1115 0.6074 1.7102 12.2671 5.0869 3.1647 2.2551 162.2790 0.8484 132.2984 7.3332 2.0649 35.4371 7.0800 31.3505 69.8246 13.8802 7.8983 3.8353 5.4295 23.1144 7.1805 3.7307 1.6977 9.3372 5.2994 1.4669 67.1899 21.3556 9.0810 29.0999 10.2589 30.0134 33.5399 4.9973 93.5917 70.1663 232.3701 22.5012 66.0950 62.8814 64.9867 22.9435 61.2397 25.2078 5.8670 38.4183 27.4884 0.2439 6.9724 72.2854 47.6886 11.8283 8.2917 20.2426 0.1681 88.7864 15.6295 139.4929 84.2651 10.7097 16.9523 56.7866 64.1566 104.5181 39.1242 26.3070 11.7381 5.5893 57.4229 13.0746 5.8419 2.7815 88.7570 6.8262 21.5615 26.8977 18.9975 22.5721 8.4963 21.5608 26.7691 29.5671 40.0233 16.2770 9.1674 10.9431 47.2818 82.2014 4.7615 6.1522 21.6490 28.6840 10.3568 9.0948 36.7131 57.6638 15.2033 12.8688 11.6181 6.7315 2.5097 23.8468 14.6111 2.2457 1.5077 3.5031 1.6668 228.5498 119.3011 54.8683 35.0980 26.6119 11.6410 5.3532 49.5874 7.3348 1.2742 6.6313 1.3100 3.3529 35.5120 37.6744 282.6525 3.8195 18.1162 35.5479 30.7740 5.6012 5.9371 103.0916
temp: 298.150 k
press: 1.00000 atm
elementType: 8 8 8 8 8 8 8 7 7 6 6 6 6 6 6 6 6 6 6 6 6 6 6 6 6 6 1 1 1 1 1 1 1 1 1 1 1 1 1 1 1 1 1 1 1 1 1 1
symmnumber: 1
zpe: 1000137.1 jmol-1
zpe.correction: 0.380932 hartree
zpe.thermalcorrener: 0.405846 hartree
zpe.thermalcorrenthalpy: 0.406790 hartree
zpe.thermalcorrgfe: 0.326027 hartree
zpe.sumelectzpe: -1295.093229 hartree
zpe.sumelectthermal: -1295.068315 hartree
zpe.sumelectthermalent: -1295.067371 hartree
zpe.sumelectthermalfe: -1295.148134 hartree
dipole: 0.2979 -2.2189 1.5401
dipole: 2.7174
quadrupole: -183.7424 -141.8754 -151.4297
quadrupole: -1.8055 -3.6913 4.9920
quadrupole: -24.7265 17.1404 7.5861 -1.8055 -3.6913 4.9920
hfenergy: -1295.4741608 hartree
pointgroup: C01 [X(C17H22N2O7)]
dipole: -0.0230375 1.024128 -0.3059097 debye
polarizability: 297.381081|24.3893115|219.3260098|-24.9034777|22.8581805|159.7743863 unknown
InChI: InChI=1S/C17H22N2O7/c20-6-11(21)14(22)16(24)15(23)13-12-8(5-10(19-13)17(25)26)7-3-1-2-4-9(7)18-12/h1-4,10-11,13-16,18-25H,5-6H2
charge 0 multiplicity 1
48 atoms
O  -0.447896 2.658383 1.496846
O  -2.961114 1.975482 1.967466
O  -2.247609 0.464452 -1.353392
O  -4.060198 -1.258756 -0.009122
O  -1.886852 -2.84577 -1.040939
O  -0.168745 -4.089778 -0.1082
O  -6.418507 -0.710568 -1.271943
N  -0.340651 -1.103301 1.048527
N  2.296155 1.634473 0.994225
C  0.138988 0.273489 1.353276
C  -0.80746 1.398688 0.808891
C  1.537095 0.469849 0.821373
C  2.234762 -0.438291 0.022188
C  0.088297 -1.63062 -0.284848
C  1.633456 -1.752933 -0.418811
C  -2.317471 1.049949 1.011989
C  3.50147 0.184505 -0.311763
C  -3.130092 1.027347 -0.307317
C  3.50689 1.491217 0.305115
C  -4.403242 0.163438 -0.168583
C  -0.61071 -2.974659 -0.453175
C  4.626792 -0.218335 -1.078327
C  4.59381 2.381535 0.171066
C  -5.369743 0.295988 -1.368204
C  5.712592 0.669066 -1.215825
C  5.696147 1.955164 -0.598785
H  0.114718 0.369224 2.459925
H  -0.590861 1.583283 -0.253464
H  -0.309427 -0.933975 -1.04231
H  1.903324 -1.975344 -1.470222
H  1.989843 -2.610282 0.186354
H  -0.070427 -1.757558 1.796714
H  -2.392108 0.059603 1.488731
H  1.914864 2.482534 1.415714
H  -3.416243 2.069507 -0.582419
H  -4.93338 0.446084 0.758924
H  -0.958543 2.663776 2.353187
H  4.65388 -1.205213 -1.554546
H  4.587094 3.369412 0.645061
H  -3.024945 2.872371 1.542917
H  -4.815321 0.185496 -2.333559
H  -5.870909 1.280348 -1.364864
H  -2.723316 0.468263 -2.222404
H  6.587303 0.370557 -1.804554
H  6.556332 2.622358 -0.724396
H  -3.202444 -1.47065 -0.481007
H  -2.316153 -3.744299 -1.081361
H  -5.969745 -1.523108 -0.905645
