program: Gaussian 09
title: 000192636
version: EM64L-G09RevD.01
frameworkgroup: C1[X(C9H12N2O5S)]
method: RPBEPBE
basis: SDD
operation: Freq
keyword: #p
keyword: freq=noraman
keyword: PBEPBE/SDD
title: #p freq=noraman PBEPBE/SDD
converged: YES YES NO NO
title: Mulliken charges:
elementType: S O O O O O N N C C C C C C C C C H H H H H H H H H H H H
charge: 0.180874 -0.438775 -0.394344 -0.277535 -0.406841 -0.233242 -0.417061 -0.083651 -0.581511 -0.472944 0.428119 -0.693160 -0.083331 -0.423917 0.213198 -0.243957 0.164523 0.312531 0.279121 0.287227 0.283845 0.306068 0.272346 0.351674 0.274745 0.258358 0.362884 0.385158 0.389594
chargesum: 0.00000
title: Mulliken charges with hydrogens summed into heavy atoms:
elementType: S O O O O O N N C C C C C C C C C
charge: 0.180874 -0.075891 -0.009185 -0.277535 -0.017247 -0.233242 -0.065386 -0.083651 -0.268980 0.093404 0.428119 -0.103247 0.189015 -0.149171 0.213198 0.014402 0.164523
polarizability: 1.52028604e+02 -1.12764557e+01 1.33762109e+02 1.25707048e+01 8.21232101e+00 1.31585800e+02
1716.lowfreq: -7.8988 -5.6632 -0.0020 -0.0009 0.0016 2.5586 16.5514 19.5663 32.2935
frequency: 16.3382 19.5232 32.2399 45.6341 59.5105 86.4266 110.1349 120.3808 137.5801 169.7851 179.6218 207.7560 229.0316 269.1446 285.9403 324.2584 339.6440 357.8721 379.0784 451.0282 486.7512 508.0457 572.5343 597.9398 608.4500 640.8482 646.1435 657.8884 681.7572 691.0018 723.2111 752.6785 766.5325 772.8701 788.0356 840.4602 873.2703 896.0367 926.5496 945.0172 991.2210 1001.4717 1017.3157 1043.2486 1068.0649 1081.0023 1094.4280 1114.4332 1156.2781 1166.0128 1187.0959 1218.1533 1221.7543 1230.4593 1253.7406 1263.2989 1290.6110 1297.1496 1315.6513 1359.2674 1362.7245 1369.4214 1393.8902 1424.5761 1426.6885 1436.9675 1544.5593 1641.3816 1644.3859 2999.1184 3028.1823 3047.1521 3065.9674 3069.2406 3107.8600 3233.0444 3239.2553 3486.8392 3495.7612 3509.4101 3515.1071
redmass: 7.9010 8.2530 7.7824 8.2974 7.8788 5.5791 5.0193 4.6205 6.0624 5.1498 4.6091 5.1834 6.4232 3.7551 4.7444 5.7977 5.5642 6.7335 1.2501 4.3302 2.2787 2.6415 4.8838 1.6031 3.1728 3.6699 1.4822 3.6956 3.5544 3.2367 4.4378 3.9983 2.7522 1.2371 1.3667 1.3544 3.8570 5.0439 2.3057 3.0184 5.0098 3.0479 5.5358 3.4317 2.2741 2.0864 2.3963 1.8242 1.1752 1.2052 1.1781 1.1780 1.8003 1.5291 1.3740 1.6172 1.5378 2.0748 1.2473 2.5377 1.8716 2.4448 1.5454 3.0965 1.0988 1.0919 4.5271 7.5687 8.4748 1.0619 1.0593 1.0868 1.0947 1.0857 1.1056 1.0959 1.1012 1.0654 1.0639 1.0659 1.0810
irintensity: 0.7050 0.4463 0.1612 1.9864 1.2837 4.0950 3.5266 0.9662 5.5742 1.1019 7.5258 0.5402 4.7002 9.2502 4.2117 2.1618 21.1486 14.6914 119.3336 5.0274 17.1651 39.0525 38.7400 123.8770 13.2935 22.0929 93.1184 36.9165 7.3660 107.0338 3.5089 51.3859 12.6815 132.9243 7.5300 40.2837 4.9431 13.2244 30.2706 26.3177 157.0033 2.4859 12.7630 140.7578 189.3060 79.3910 38.2407 12.2011 7.9674 3.3455 0.6263 35.5240 23.8359 2.7698 1.5700 13.8025 60.9915 4.8717 18.6259 95.0561 64.4600 25.1512 18.1641 12.7638 32.3054 13.0788 18.9748 201.7247 189.9818 13.9785 3.4166 4.5067 2.0263 6.7652 1.3973 4.7088 1.5153 33.5359 24.0474 82.1504 85.8085
temp: 298.150 k
press: 1.00000 atm
elementType: 16 8 8 8 8 8 7 7 6 6 6 6 6 6 6 6 6 1 1 1 1 1 1 1 1 1 1 1 1
symmnumber: 1
zpe: 559907.0 jmol-1
zpe.correction: 0.213257 hartree
zpe.thermalcorrener: 0.230930 hartree
zpe.thermalcorrenthalpy: 0.231875 hartree
zpe.thermalcorrgfe: 0.164031 hartree
zpe.sumelectzpe: -1232.547428 hartree
zpe.sumelectthermal: -1232.529755 hartree
zpe.sumelectthermalent: -1232.528811 hartree
zpe.sumelectthermalfe: -1232.596654 hartree
dipole: 2.9487 -4.4263 2.5490
dipole: 5.8978
quadrupole: -106.5272 -117.2788 -105.2114
quadrupole: -8.7323 5.1495 -1.4186
quadrupole: 3.1453 -7.6063 4.4610 -8.7323 5.1495 -1.4186
hfenergy: -1232.7606855 hartree
pointgroup: C01 [X(C9H12N2O5S1)]
dipole: -1.1371358 -1.5897748 -1.2504987 debye
polarizability: 149.2961822|10.4520478|131.6536968|15.0231944|-7.7753414|136.4266331 unknown
InChI: InChI=1S/C9H12N2O5S/c12-6(9(15)16)3-17-7(1-8(13)14)5-2-10-4-11-5/h2,4,6-7,11-13,15H,1,3H2
charge 0 multiplicity 1
29 atoms
S  0.209779 -0.70604 1.915619
O  4.280661 -0.626321 1.217979
O  -4.084223 -1.990931 -0.56671
O  -2.526109 -0.96332 -1.933566
O  1.78785 -1.951561 -1.094562
O  3.608118 -0.551099 -1.435441
N  -1.231278 1.512221 -1.299516
N  -0.941177 3.370461 -0.045258
C  -0.766153 -0.408277 0.302284
C  -2.120322 -1.130442 0.512852
C  -0.885909 1.059677 -0.013415
C  1.914795 -0.023844 1.482503
C  2.922138 -1.040886 0.870761
C  -0.707198 2.228998 0.73982
C  -2.883681 -1.321643 -0.783184
C  -1.260797 2.899851 -1.268479
C  2.827382 -1.140255 -0.652703
H  -0.210207 -0.936361 -0.490538
H  -1.954821 -2.134389 0.95149
H  -2.759915 -0.577683 1.225387
H  1.790084 0.88175 0.86431
H  2.344473 0.273909 2.453293
H  2.756393 -2.034024 1.319208
H  -1.514799 0.8830 -2.056566
H  -0.423559 2.310351 1.786259
H  -1.513236 3.510552 -2.132167
H  4.652868 -0.105904 0.454393
H  -4.567598 -2.108727 -1.429739
H  1.786941 -1.983462 -2.091014
