program: Gaussian 09
title: 000192633
version: EM64L-G09RevD.01
frameworkgroup: C1[X(C15H20N2O)]
method: RPBEPBE
basis: SDD
operation: Freq
keyword: #p
keyword: freq=noraman
keyword: PBEPBE/SDD
title: #p freq=noraman PBEPBE/SDD
converged: YES YES NO NO
title: Mulliken charges:
elementType: O N N C C C C C C C C C C C C C C C H H H H H H H H H H H H H H H H H H H H
charge: -0.282295 -0.156200 -0.383812 0.361452 0.090452 -0.532642 0.248343 -0.442385 -0.365419 -0.420955 -0.344679 -0.635302 -0.254678 -0.230447 -0.501844 0.236586 -0.348136 -0.684561 0.224663 0.208873 0.265621 0.215939 0.257948 0.249080 0.233931 0.326321 0.240773 0.232065 0.238729 0.223595 0.204933 0.225910 0.222295 0.199040 0.241425 0.206116 0.209241 0.220023
chargesum: 0.00000
title: Mulliken charges with hydrogens summed into heavy atoms:
elementType: O N N C C C C C C C C C C C C C C C
charge: -0.282295 -0.156200 -0.057491 0.361452 0.090452 -0.099106 0.248343 -0.176764 0.108467 -0.171875 -0.110749 0.076265 -0.031083 -0.008152 -0.071001 0.236586 0.092330 -0.049181
polarizability: 2.13879074e+02 -8.13955511e+00 2.06674091e+02 -2.46007702e+01 -1.19195853e+00 1.14437648e+02
1716.lowfreq: -12.5933 -7.1049 0.0002 0.0007 0.0007 4.1659 14.3952 19.1366 31.9693
frequency: 12.1078 18.1341 31.9025 48.3410 75.5598 82.4504 86.5577 117.9076 141.1525 160.0662 194.7990 221.7903 227.0698 232.5952 248.9825 287.3023 315.2893 343.1596 415.4810 428.3102 460.7880 522.6229 526.6109 545.7033 572.8188 578.5005 593.3299 619.4317 645.2360 700.1606 745.0569 747.6836 751.3668 763.1631 767.7833 798.0136 824.5463 853.0945 868.8295 882.6691 926.0545 935.0781 954.8158 973.3968 1010.4191 1016.8967 1036.2784 1057.0537 1057.9240 1068.8752 1096.6133 1118.3194 1119.1265 1125.3105 1131.7098 1167.2154 1183.8322 1204.5250 1210.8351 1232.7609 1245.0524 1258.8590 1275.5452 1308.8243 1315.2989 1335.2799 1347.2753 1354.4819 1366.7872 1374.3555 1390.5200 1412.4108 1435.3138 1446.0126 1461.6571 1463.3138 1468.0426 1471.0043 1475.7311 1477.0421 1481.0887 1486.8002 1489.5171 1495.9398 1555.8247 1578.0635 1615.4335 1623.8144 2969.8563 2971.7406 2976.6025 2979.5274 2988.2219 2988.5901 3024.1647 3047.1323 3047.7212 3053.1254 3069.9312 3073.0423 3075.2397 3106.4852 3123.0373 3131.6158 3144.9407 3162.1872 3209.1450 3535.2952
redmass: 3.5482 4.0124 5.9406 2.5688 2.2575 1.4054 2.2866 3.2119 2.7558 3.1129 4.9472 2.6426 1.1755 3.7120 2.8738 3.2126 3.8983 3.1185 3.0820 2.8072 2.9525 3.4305 5.1618 3.9553 3.1851 2.7855 3.7239 1.4352 2.7070 3.9900 1.2335 3.5896 1.3356 4.5544 4.0490 1.4640 2.3735 1.4375 1.4459 1.9318 2.4858 1.3678 3.1923 1.2905 2.1371 2.9793 2.0535 2.5838 2.1612 2.1742 1.9583 1.4696 2.0281 1.9687 1.6786 1.1874 1.2970 1.6336 1.4111 1.2917 1.4908 1.5190 1.2191 1.3256 1.3346 2.3048 1.4615 1.6554 2.7371 2.7786 1.2155 4.4328 1.5384 1.0974 1.1040 1.2242 1.0417 2.2182 1.0492 1.0456 2.5609 1.0845 1.8655 1.1679 5.8718 6.6673 6.0694 7.1529 1.0485 1.0461 1.0357 1.0657 1.0607 1.0646 1.0976 1.1004 1.0997 1.1018 1.0984 1.0991 1.1013 1.0986 1.0849 1.0887 1.0951 1.1001 1.0979 1.0777
irintensity: 0.0716 0.3870 5.7668 1.9632 0.4390 2.3119 1.4209 9.9552 2.3287 1.9607 1.6106 2.7756 0.1706 1.2182 4.0828 5.1032 2.4813 0.7132 4.8524 15.9037 0.3357 0.2424 0.2815 10.5559 16.8135 40.3882 12.0447 84.6174 4.8996 0.8852 15.0935 12.5451 97.0423 1.0365 0.6319 16.1126 9.2303 0.3214 0.9078 7.1380 3.8923 2.1892 3.7768 0.1170 12.3627 3.6548 10.9458 7.5290 10.7213 1.6944 15.3940 0.5312 4.9321 3.8973 16.6147 23.6742 18.3850 13.2056 3.8440 1.2927 58.4224 31.6509 18.7594 19.9976 8.5453 34.9679 9.7383 14.5722 3.3530 17.6533 10.3038 32.6508 2.5415 11.5449 21.4873 37.2247 14.3931 21.4760 3.4559 9.1697 58.6951 15.9521 229.8361 14.7758 9.8713 0.3106 205.3611 3.7192 20.9881 34.2167 78.1172 40.7744 19.8410 46.3455 17.9734 28.5812 0.4183 27.3091 6.8296 50.1295 83.1519 11.1606 1.6817 3.6671 36.8658 25.3955 1.0171 37.6552
temp: 298.150 k
press: 1.00000 atm
elementType: 8 7 7 6 6 6 6 6 6 6 6 6 6 6 6 6 6 6 1 1 1 1 1 1 1 1 1 1 1 1 1 1 1 1 1 1 1 1
symmnumber: 1
zpe: 841993.4 jmol-1
zpe.correction: 0.320698 hartree
zpe.thermalcorrener: 0.339097 hartree
zpe.thermalcorrenthalpy: 0.340041 hartree
zpe.thermalcorrgfe: 0.270786 hartree
zpe.sumelectzpe: -767.006456 hartree
zpe.sumelectthermal: -766.988058 hartree
zpe.sumelectthermalent: -766.987113 hartree
zpe.sumelectthermalfe: -767.056368 hartree
dipole: 5.5579 1.1726 -1.9990
dipole: 6.0217
quadrupole: -102.6369 -106.0053 -109.3294
quadrupole: -15.7533 -4.7516 0.8798
quadrupole: 3.3536 -0.0148 -3.3388 -15.7533 -4.7516 0.8798
hfenergy: -767.3271544 hartree
pointgroup: C01 [X(C15H20N2O1)]
dipole: 2.2013713 -0.4643908 0.7423463 debye
polarizability: 214.706038|7.9119154|206.7206248|22.8661606|-0.4002557|113.5641503 unknown
InChI: InChI=1S/C15H20N2O/c1-3-6-15(18)16-10-9-12-11-17(2)14-8-5-4-7-13(12)14/h4-5,7-8,11,16H,3,6,9-10H2,1-2H3
charge 0 multiplicity 1
38 atoms
O  -3.676335 2.00099 -0.009928
N  3.326447 0.536131 0.434546
N  -1.550043 1.260049 0.591667
C  1.337937 1.272738 -0.46384
C  1.333322 -0.183057 -0.447091
C  0.229017 2.187535 -0.931496
C  2.588623 -0.611505 0.120602
C  2.56574 1.662485 0.07617
C  -0.848206 2.474521 0.154268
C  0.401797 -1.170899 -0.87129
C  2.921771 -1.975748 0.28045
C  4.672595 0.545256 1.007918
C  0.730106 -2.531983 -0.715465
C  1.974979 -2.930505 -0.142544
C  -3.471305 -0.240816 0.981766
C  -2.92259 1.098488 0.473064
C  -4.521775 -0.841381 0.017239
C  -5.202447 -2.096794 0.600332
H  -0.27551 1.757698 -1.817714
H  0.651347 3.161837 -1.244729
H  2.962798 2.665982 0.226282
H  -0.366122 2.963639 1.023992
H  -1.623913 3.153679 -0.241149
H  -0.551742 -0.877951 -1.325581
H  3.878682 -2.288779 0.712254
H  -0.988776 0.485637 0.953122
H  5.398831 0.060551 0.328838
H  4.992857 1.586139 1.173377
H  4.692609 0.017242 1.979283
H  0.023167 -3.302135 -1.043685
H  -2.652113 -0.96516 1.161661
H  -3.956679 -0.052067 1.960999
H  2.199909 -3.997491 -0.034921
H  -4.035141 -1.08951 -0.946839
H  -5.270703 -0.059006 -0.202498
H  -4.464706 -2.892648 0.817771
H  -5.728489 -1.859441 1.54465
H  -5.94664 -2.510421 -0.104583
