program: Gaussian 09
title: 000192610
version: EM64L-G09RevD.01
frameworkgroup: C1[X(C9H13N3OS)]
method: RPBEPBE
basis: SDD
operation: Freq
keyword: #p
keyword: freq=noraman
keyword: PBEPBE/SDD
title: #p freq=noraman PBEPBE/SDD
converged: YES YES NO NO
title: Mulliken charges:
elementType: S O N N N C C C C C C C C C H H H H H H H H H H H H H
charge: 0.479772 -0.259723 -0.061134 -0.390021 -0.435891 -0.458925 -0.499360 -0.453952 0.402508 -0.320176 -0.630413 -0.041571 0.168303 -0.499603 0.228517 0.222615 0.221074 0.244519 0.219125 0.238083 0.248346 0.204483 0.225490 0.224676 0.245199 0.232822 0.245236
chargesum: 0.00000
title: Mulliken charges with hydrogens summed into heavy atoms:
elementType: S O N N N C C C C C C C C C
charge: 0.479772 -0.259723 -0.061134 -0.390021 -0.435891 -0.007792 -0.033766 0.003257 0.402508 -0.071830 0.024235 -0.041571 0.168303 0.223654
polarizability: 1.85295944e+02 -1.51393557e+00 1.45806270e+02 2.41200590e+00 3.01309346e+00 8.60109626e+01
1716.lowfreq: -0.0029 -0.0025 0.0013 5.0330 8.8265 11.2735 32.6368 53.5912 104.1456
frequency: 32.3604 53.4808 104.1286 120.4523 129.3753 161.9192 191.0842 196.6373 218.4140 245.2050 282.4240 289.2174 329.0836 383.5323 402.8080 435.3073 486.0936 509.9683 530.5893 541.5044 566.7232 636.4483 696.0553 718.9145 739.0641 763.6170 782.0534 825.4163 902.7468 922.9501 941.8709 962.7926 988.7578 1013.2440 1034.9682 1067.5891 1115.6668 1119.7433 1121.6905 1155.0424 1168.3290 1195.4257 1218.4909 1263.7612 1279.5782 1295.9303 1317.5344 1327.1884 1344.5991 1355.9575 1376.8553 1428.8117 1435.0947 1443.4766 1448.2390 1449.3909 1458.3703 1463.5542 1466.5387 1470.8942 1488.1855 1642.4148 2879.9911 2932.7476 2985.1305 2991.1143 2999.3714 3017.2778 3018.3854 3036.7377 3055.1378 3074.3499 3100.7314 3121.5862 3147.2647
redmass: 3.5195 3.4670 3.9556 3.8333 4.5353 1.1804 3.5547 2.3436 1.1499 3.1120 5.4108 4.7729 5.9764 1.9895 2.0325 3.2367 7.6571 3.6916 7.4881 8.0137 5.1204 8.5012 10.9336 4.2722 4.9171 4.6500 2.5764 1.4706 4.9051 2.5255 3.3376 2.8626 2.4348 2.2929 2.2726 2.0027 1.2555 1.7744 1.3947 1.4341 1.3638 1.7824 2.4077 1.7091 2.0587 2.0661 1.8875 1.6408 1.4637 1.6183 2.7443 1.1435 2.2351 1.0981 1.0937 1.0678 1.1164 1.0537 1.0649 2.7356 1.0509 6.6798 1.0539 1.0684 1.0605 1.0624 1.0293 1.0798 1.0870 1.0986 1.1042 1.1008 1.1047 1.0914 1.1051
irintensity: 0.5287 0.3580 2.4619 6.2854 2.6293 0.4177 1.5170 3.1658 0.2267 0.7300 1.5244 0.0288 1.7643 6.5823 1.5886 3.5003 7.0016 15.1208 14.8742 14.1666 6.9392 6.0960 31.1929 0.3603 2.7166 13.8870 4.5185 14.4246 12.2788 2.2024 18.9194 21.2639 7.0843 17.1061 20.8502 10.1246 0.0824 24.5616 0.1848 3.9573 12.7573 43.3435 44.2385 6.0006 26.9346 2.0206 5.1511 41.6623 3.7749 15.5135 82.7483 4.8702 5.3328 20.7412 18.6033 14.1773 13.7995 15.2643 17.7368 91.3805 4.9003 24.2210 95.2274 39.1961 44.0130 21.0736 37.5396 70.7003 16.9180 21.2346 40.5935 31.1583 23.7160 6.4325 17.1884
temp: 298.150 k
press: 1.00000 atm
elementType: 16 8 7 7 7 6 6 6 6 6 6 6 6 6 1 1 1 1 1 1 1 1 1 1 1 1 1
symmnumber: 1
zpe: 558760.1 jmol-1
zpe.correction: 0.212820 hartree
zpe.thermalcorrener: 0.226759 hartree
zpe.thermalcorrenthalpy: 0.227703 hartree
zpe.thermalcorrgfe: 0.171545 hartree
zpe.sumelectzpe: -987.149947 hartree
zpe.sumelectthermal: -987.136009 hartree
zpe.sumelectthermalent: -987.135065 hartree
zpe.sumelectthermalfe: -987.191223 hartree
dipole: -0.3945 2.6377 -0.5914
dipole: 2.7319
quadrupole: -95.7309 -83.1301 -89.2632
quadrupole: 5.2509 2.4241 1.1956
quadrupole: -6.3562 6.2446 0.1116 5.2509 2.4241 1.1956
hfenergy: -987.3627678 hartree
pointgroup: C01 [X(C9H13N3O1S1)]
dipole: -0.0638155 1.0498803 -0.221042 debye
polarizability: 184.6544051|-4.8918024|146.2634298|4.1693815|3.4506368|86.1953413 unknown
InChI: InChI=1S/C9H13N3OS/c1-12-5-3-7(4-6-12)8-9(13-2)11-14-10-8/h3H,4-6H2,1-2H3
charge 0 multiplicity 1
27 atoms
S  3.200843 -1.8908 -0.014022
O  1.70183 1.676955 -0.063182
N  -3.360506 0.181781 0.048227
N  1.402255 -1.955097 0.091019
N  3.279554 -0.09977 -0.070652
C  -2.51453 0.774505 1.113936
C  -1.016781 0.89975 0.715359
C  -2.903567 -1.193471 -0.266484
C  -0.51437 -0.414916 0.121853
C  -1.393564 -1.361987 -0.328351
C  -3.502971 1.045164 -1.144739
C  0.942348 -0.684996 0.068532
C  2.011516 0.335272 -0.01512
C  2.858119 2.595879 -0.190806
H  -2.602332 0.128216 2.008874
H  -2.921673 1.767428 1.38016
H  -0.415332 1.175288 1.602408
H  -0.873599 1.723529 -0.009431
H  -3.360359 -1.508522 -1.224485
H  -3.30119 -1.893084 0.502107
H  -1.002237 -2.310694 -0.718939
H  -2.561642 1.196688 -1.727084
H  -3.873632 2.037032 -0.828601
H  -4.254205 0.60667 -1.826145
H  3.533878 2.479849 0.673733
H  2.412087 3.599936 -0.218689
H  3.416061 2.377296 -1.117378
