program: Gaussian 09
title: 000192603
version: EM64L-G09RevD.01
frameworkgroup: C1[X(C5H8NO2PS)]
method: RPBEPBE
basis: SDD
operation: Freq
keyword: #p
keyword: freq=noraman
keyword: PBEPBE/SDD
title: #p freq=noraman PBEPBE/SDD
converged: NO YES NO NO
title: Mulliken charges:
elementType: S P O O N C C C C C H H H H H H H H
charge: -0.248903 0.606283 -0.224334 -0.265063 -0.518371 -0.829700 -0.829212 -0.116936 0.293222 -0.141044 0.269688 0.293919 0.282342 0.282201 0.293171 0.269736 0.310582 0.272420
chargesum: 0.00000
title: Mulliken charges with hydrogens summed into heavy atoms:
elementType: S P O O N C C C C C
charge: -0.248903 0.606283 -0.224334 -0.265063 -0.518371 0.016248 0.015896 0.193646 0.293222 0.131376
polarizability: 1.18328303e+02 7.67956196e+00 1.16773346e+02 6.20536985e-02 3.69074888e-02 6.92832191e+01
1716.lowfreq: -13.8220 -9.8858 -0.0027 0.0004 0.0018 10.4439 55.2085 102.2985 124.9597
frequency: 55.0891 102.2890 124.9586 171.4755 186.6972 189.2089 194.5040 220.0187 233.4289 251.9612 309.9925 386.1829 493.3054 529.2590 572.2363 672.7808 677.9663 707.9901 715.3294 718.0031 836.5574 859.4444 875.0896 918.6069 922.3436 984.8825 1003.4776 1011.8611 1060.4950 1130.6990 1197.4636 1305.2365 1323.5099 1341.0159 1430.8461 1437.5442 1442.2114 1450.4661 1575.0375 1694.4098 3009.8719 3011.1717 3131.2796 3133.3725 3144.2698 3145.5440 3241.1245 3288.9411
redmass: 5.5466 4.3903 7.7188 1.0402 3.5124 1.3614 3.1743 2.2114 5.6222 4.3492 5.8141 7.1856 9.5877 7.4292 4.2891 2.3952 6.4291 3.4115 10.2854 2.4439 1.2889 6.4242 6.4197 1.2959 1.2605 1.5884 3.1260 1.4315 2.2167 1.7505 3.8282 2.0981 1.1606 1.1577 1.0465 1.0507 1.0444 1.0462 5.8424 11.8718 1.0312 1.0311 1.1030 1.1028 1.1019 1.1024 1.0946 1.1095
irintensity: 11.8477 0.6258 14.0663 0.0043 1.0662 1.8472 2.5866 1.8559 1.9085 4.2391 10.8427 28.8585 14.3105 45.5125 0.8015 78.9014 22.1843 37.2318 0.0888 2.6272 5.2731 13.1074 28.6351 16.5295 13.3934 122.5575 6.0670 53.4146 171.8858 89.3097 66.1536 51.5027 23.8603 28.4850 8.7030 1.6204 19.0313 28.3008 6.0659 426.2740 0.9836 2.7661 0.0190 0.5600 0.5363 1.8224 17.9532 0.3849
temp: 298.150 k
press: 1.00000 atm
elementType: 16 15 8 8 7 6 6 6 6 6 1 1 1 1 1 1 1 1
symmnumber: 1
zpe: 337463.2 jmol-1
zpe.correction: 0.128533 hartree
zpe.thermalcorrener: 0.139906 hartree
zpe.thermalcorrenthalpy: 0.140850 hartree
zpe.thermalcorrgfe: 0.091120 hartree
zpe.sumelectzpe: -1139.053795 hartree
zpe.sumelectthermal: -1139.042422 hartree
zpe.sumelectthermalent: -1139.041478 hartree
zpe.sumelectthermalfe: -1139.091208 hartree
dipole: -0.8570 0.0087 0.0429
dipole: 0.8582
quadrupole: -85.4046 -73.4085 -71.4028
quadrupole: -17.6716 -0.0183 -0.0248
quadrupole: -8.6660 3.3302 5.3358 -17.6716 -0.0183 -0.0248
hfenergy: -1139.1823279 hartree
pointgroup: C01 [X(C5H8N1O2P1S1)]
dipole: 0.3195448 0.0049419 -0.1089039 debye
dipolederiv: -0.4791477 -0.0021031 0.0573198 -0.0043899 -0.4374582 0.0134038 0.0916512 0.0111607 -0.6456602 1.8128307 -0.0090846 -0.5072624 -0.0298886 1.0241664 0.0033825 -0.2655778 -0.0120294 1.4070185 -0.8866064 0.0806484 -0.350906 0.039584 -0.1728058 0.0635897 0.07698 0.0361047 -0.613087 -0.5619407 0.0362406 -0.2441353 0.0234958 -0.3687073 0.097963 -0.1068632 0.0892872 -1.2606677 -1.3297726 0.0248703 0.455758 0.0681061 -0.345409 0.0299516 0.0015329 0.0613347 -1.019292 -0.2806549 -0.0481218 0.0740286 0.0282018 -0.2629247 -0.0019236 -0.0265717 0.0683691 -0.3153162 -0.277216 0.0384439 0.0825456 -0.0204535 -0.2554334 0.0012333 -0.0391608 -0.0547541 -0.3250375 0.3737153 -0.0455015 0.1108212 -0.0874297 -0.150383 -0.0214713 0.5568908 -0.0534201 0.0040946 1.0641939 -0.079645 0.3197135 -0.0320578 0.3190402 -0.1625575 -0.1856621 -0.1289042 1.8644176 -0.0674324 -0.0023636 -0.0323671 0.0033483 -0.1456791 -0.0490446 -0.0876723 -0.0455522 0.405445 -0.0556129 0.0172316 -0.0217523 0.0422751 0.1006585 0.0043898 -0.025069 0.0206229 0.1145658 0.1411376 0.0001505 0.0539314 -0.0320512 0.0753435 0.05105 0.0550968 0.0225532 -0.0071552 0.1059942 -0.0417014 -0.0261034 -0.051295 0.0041652 -0.0524782 -0.0255821 -0.0379736 0.062152 0.1166398 0.0293653 -0.0139988 0.0388146 -0.0204415 0.0418336 -0.0136762 0.0274806 0.0758987 0.1408593 -0.0176139 0.0463505 0.0138621 0.0835974 -0.0418757 0.0572406 -0.014498 -0.0194318 -0.0604246 0.0078387 -0.0231433 -0.0160292 0.1089725 -0.0024857 -0.0331585 -0.0182385 0.1106146 0.1794072 -0.0035543 0.056506 0.0029431 0.2072005 0.0073481 -0.0148087 0.0123007 0.0867684 0.0640302 0.0149 -0.0373059 0.0129639 0.2360977 0.0176913 -0.01559 0.0161561 0.0746726 unknown
polarizability: 113.1324413|-2.4277955|69.8055613|-6.6883389|-4.0844157|121.4468657 unknown
InChI: InChI=1S/C5H8NO2PS/c1-9(2,10)6-3-4-8-5(6)7/h3-4H,1-2H3
charge 0 multiplicity 1
18 atoms
S  2.273396 0.49984 -2.019855
P  1.605511 0.382894 -0.053155
O  -2.340053 0.568631 0.794452
O  -0.584496 0.309438 2.382167
N  -0.215857 0.500043 0.014319
C  1.92058 -1.229358 0.83247
C  2.119023 1.771634 1.083239
C  -1.072398 0.661101 -1.104019
C  -0.969681 0.441792 1.201758
C  -2.349896 0.700238 -0.626431
H  3.007987 -1.356706 0.956771
H  1.41685 -1.209477 1.812628
H  1.526913 -2.047389 0.210828
H  1.841762 2.726279 0.611414
H  1.606046 1.653855 2.051781
H  3.212249 1.734242 1.21549
H  -0.675782 0.7300 -2.113617
H  -3.321057 0.807145 -1.09624
