program: Gaussian 09
title: 000192599
version: EM64L-G09RevD.01
frameworkgroup: C1[X(C11H15NO)]
method: RPBEPBE
basis: SDD
operation: Freq
keyword: #p
keyword: freq=noraman
keyword: PBEPBE/SDD
title: #p freq=noraman PBEPBE/SDD
converged: YES YES NO NO
title: Mulliken charges:
elementType: O N C C C C C C C C C C C H H H H H H H H H H H H H H H
charge: -0.276743 -0.546230 0.186125 -0.565066 0.553900 -0.536254 0.218387 -0.127153 -0.308965 -0.532329 -0.374512 -0.460054 -0.691747 0.190543 0.237493 0.238834 0.238067 0.228414 0.225146 0.224644 0.257455 0.233476 0.230218 0.207392 0.195543 0.235999 0.253555 0.263864
chargesum: 0.00000
title: Mulliken charges with hydrogens summed into heavy atoms:
elementType: O N C C C C C C C C C C C
charge: -0.276743 -0.028811 0.186125 -0.137031 0.553900 -0.059353 0.218387 0.101260 0.140825 -0.274874 -0.141036 -0.229836 -0.052813
polarizability: 1.75390558e+02 -9.33520027e-01 1.21135636e+02 1.15075558e+01 -7.68060241e-01 8.40114216e+01
1716.lowfreq: -62.8086 -16.5195 -4.0683 -0.0005 -0.0003 0.0004 5.5597 29.6605 57.1752
frequency: -62.6555 27.4408 57.1618 71.7224 161.3563 221.7484 225.1136 240.4475 277.7844 302.8472 318.3753 388.9161 412.7890 425.4631 441.9511 521.3961 579.7435 620.2171 662.5080 688.5076 704.6620 757.8261 781.8541 801.6469 816.6381 834.4055 879.6733 886.6827 891.7926 934.1203 940.8956 951.0044 978.6737 1007.7840 1049.1004 1063.6418 1088.9048 1133.7398 1147.7978 1153.7239 1158.0666 1192.1931 1207.5036 1227.7512 1233.6101 1252.2544 1283.1088 1312.2540 1320.6721 1339.6716 1359.0157 1378.5883 1396.1124 1426.6790 1462.7739 1465.6173 1471.6270 1474.0479 1487.2081 1492.8698 1598.1053 1625.6650 1637.2466 2963.0911 2973.6416 2994.5899 2996.4801 3026.9496 3044.2670 3045.5755 3061.1673 3072.5596 3092.6545 3122.5504 3145.4494 3152.4868 3416.1747 3541.3142
redmass: 1.8812 3.2090 3.4010 3.7067 3.5848 1.5594 2.4859 1.1188 2.8378 3.4245 2.6793 2.2911 3.2402 2.0418 2.8669 4.7204 5.1929 5.1046 1.4849 7.0437 2.8565 4.2050 3.5667 2.0998 1.4184 1.5628 1.6393 1.6709 2.7545 1.7246 1.6726 2.1727 3.7890 1.4363 1.6528 1.9948 3.2516 1.6083 1.3989 2.1935 1.1191 1.6851 1.1171 1.3506 1.4202 3.2492 1.4554 1.5333 1.3205 1.4291 1.3348 1.2233 5.0258 3.7260 1.0687 1.1420 1.0616 1.0833 1.1232 2.7319 7.5508 7.7121 1.0932 1.0358 1.0644 1.0819 1.0589 1.0588 1.1048 1.0994 1.0991 1.0993 1.1106 1.0873 1.0961 1.0931 1.0446 1.0959
irintensity: 1.8248 0.5866 1.1648 1.4014 4.1705 9.2858 11.3691 27.6833 1.5769 1.4782 24.3000 6.7279 7.0525 7.0102 6.1981 2.2092 2.2403 6.3335 230.7615 1.7073 2.6652 14.0944 5.8932 21.4421 3.9038 12.3732 16.4229 7.4479 20.6434 19.6248 18.4700 28.6552 12.9918 3.5084 1.3505 7.7942 37.5093 5.8740 11.3863 35.9524 0.0769 2.5965 0.1349 2.8407 17.7852 78.1872 13.5958 2.0432 7.1089 1.8163 13.0400 18.7509 14.2236 38.5828 0.4910 8.5672 3.2162 17.0198 0.1526 62.6490 27.6103 37.3458 35.1305 26.3864 21.6050 30.3791 31.0143 91.1030 6.0728 18.4232 52.2059 49.4716 38.8496 10.5581 25.5727 1.5159 4.1736 0.1254
temp: 298.150 k
press: 1.00000 atm
elementType: 8 7 6 6 6 6 6 6 6 6 6 6 6 1 1 1 1 1 1 1 1 1 1 1 1 1 1 1
symmnumber: 1
zpe: 621469.9 jmol-1
zpe.correction: 0.236705 hartree
zpe.thermalcorrener: 0.248668 hartree
zpe.thermalcorrenthalpy: 0.249612 hartree
zpe.thermalcorrgfe: 0.197801 hartree
zpe.sumelectzpe: -557.153118 hartree
zpe.sumelectthermal: -557.141156 hartree
zpe.sumelectthermalent: -557.140212 hartree
zpe.sumelectthermalfe: -557.192022 hartree
dipole: 0.7981 2.1435 1.3521
dipole: 2.6570
quadrupole: -59.8303 -79.7019 -80.5040
quadrupole: -0.1403 -1.4462 -2.6392
quadrupole: 13.5151 -6.3565 -7.1586 -0.1403 -1.4462 -2.6392
hfenergy: -557.3898236 hartree
pointgroup: C01 [X(C11H15N1O1)]
dipole: 0.3036994 0.931697 0.3639315 debye
polarizability: 174.9865055|1.7020102|119.4736169|12.9335643|-7.6640262|86.077493 unknown
InChI: InChI=1S/C11H15NO/c1-8(12)6-9-2-3-10-4-5-13-11(10)7-9/h2-3,7-8H,4-6,12H2,1H3
charge 0 multiplicity 1
28 atoms
O  2.372716 -1.536143 0.467432
N  -4.444955 -0.899688 -0.035293
C  1.932536 0.720827 -0.038658
C  -2.260858 -0.14465 -0.882827
C  -0.795737 0.154319 -0.60229
C  3.414163 0.70461 0.317857
C  1.412603 -0.589302 0.069897
C  -3.109137 -0.410458 0.39602
C  3.676059 -0.802064 0.640908
C  0.070993 -0.90045 -0.203343
C  1.079042 1.763167 -0.436432
C  -0.281962 1.473801 -0.715533
C  -3.164729 0.829485 1.325734
H  -2.719861 0.699471 -1.437211
H  -2.360423 -1.044785 -1.517697
H  4.042456 1.053467 -0.521771
H  3.63485 1.349759 1.187692
H  -2.628451 -1.242753 0.947527
H  4.397707 -1.270603 -0.049075
H  3.998211 -0.969779 1.682253
H  -0.291691 -1.93012 -0.120249
H  1.455297 2.787908 -0.534246
H  -0.954008 2.281479 -1.02768
H  -3.766213 0.612003 2.228417
H  -3.633856 1.684265 0.799245
H  -2.155108 1.140769 1.650135
H  -4.948455 -0.210775 -0.609811
H  -5.03139 -1.21196 0.748296
