program: Gaussian 09
title: 000192517
version: EM64L-G09RevD.01
frameworkgroup: C1[X(C14H24N6O4)]
method: RPBEPBE
basis: SDD
operation: Freq
keyword: #p
keyword: freq=noraman
keyword: PBEPBE/SDD
title: #p freq=noraman PBEPBE/SDD
converged: YES YES NO NO
title: Mulliken charges:
elementType: O O O O N N N N N N C C C C C C C C C C C C C C H H H H H H H H H H H H H H H H H H H H H H H H
charge: -0.263493 -0.404118 -0.224092 -0.263063 -0.374394 -0.414423 -0.461060 -0.671968 -0.094086 -0.637339 -0.409803 -0.328079 -0.385702 -0.026227 -0.366051 -0.531833 0.235477 -0.409310 0.377034 0.170587 0.199561 -0.472463 -0.494339 -0.277109 0.264713 0.232467 0.198132 0.207135 0.256912 0.299771 0.207992 0.211073 0.236639 0.241449 0.315069 0.399358 0.223233 0.218140 0.433030 0.251137 0.303524 0.305518 0.245903 0.248542 0.247310 0.380688 0.298871 0.299684
chargesum: 0.00000
title: Mulliken charges with hydrogens summed into heavy atoms:
elementType: O O O O N N N N N N C C C C C C C C C C C C C C
charge: -0.263493 -0.023430 -0.224092 -0.263063 -0.059324 -0.015064 -0.028031 -0.062926 -0.094086 -0.038784 0.020796 -0.063366 0.078345 0.273544 0.053014 -0.053745 0.235477 0.032063 0.377034 0.170587 0.199561 -0.221326 0.000106 -0.029799
polarizability: 2.37057417e+02 -8.71156243e+00 2.13217419e+02 -7.01358659e+00 -1.68824445e+01 1.54938566e+02
1716.lowfreq: -23.7681 -4.0660 0.0006 0.0011 0.0012 2.9589 8.4793 19.7890 33.1558
frequency: -23.7427 18.5599 33.0926 41.4608 48.0817 52.0053 61.0546 63.5509 71.9173 87.9499 102.8140 115.9963 125.6441 149.0147 152.3436 181.1824 186.3510 192.6951 209.5727 228.9461 233.7517 258.7108 267.5259 292.1184 304.1121 337.3230 348.8529 388.3198 418.4558 444.1113 482.2296 490.4905 506.1667 509.8250 530.5022 565.0053 571.5629 605.3518 613.0573 629.2377 634.5693 657.3111 679.1996 720.2719 731.8175 735.8486 771.2021 780.7882 810.7402 819.5697 824.5237 852.5420 855.0160 871.2553 890.4574 892.2763 901.0446 908.4046 937.0804 949.0755 963.1363 984.0733 997.6395 1026.3103 1048.1773 1060.5286 1082.7964 1089.5761 1107.0505 1111.5665 1114.3633 1122.3696 1136.7438 1146.7838 1156.3059 1166.3316 1178.7891 1186.3975 1199.2080 1215.5250 1228.9369 1239.3558 1250.5170 1259.5805 1272.6694 1273.9790 1287.7943 1306.7580 1308.3460 1319.6595 1324.9663 1328.2397 1344.4300 1361.6169 1362.6770 1372.3212 1373.7303 1385.7715 1415.7494 1438.2196 1450.0655 1460.5465 1462.5218 1465.1034 1469.7577 1477.8418 1479.9253 1484.7294 1591.3612 1604.1955 1633.4945 1644.0951 1648.5835 1666.1799 2799.9653 2950.1639 2976.0950 2982.0404 2998.4445 3002.4531 3004.1156 3008.9082 3028.3738 3029.8064 3039.9348 3045.7013 3057.7905 3066.7561 3072.7934 3198.6431 3227.7876 3370.9984 3409.2270 3501.5713 3518.5745 3522.2236 3548.6760 3622.6548
redmass: 1.6322 5.9162 6.3871 7.9340 6.2942 4.2345 4.9693 6.6971 3.5877 4.4505 4.8674 4.4794 4.4532 4.2226 3.4921 2.2590 4.4484 4.0331 3.5963 3.7888 1.6298 4.7061 3.9404 3.7323 4.6300 2.6543 3.5060 3.0130 1.3530 3.4311 3.2467 5.4530 1.8433 2.0045 2.2611 3.2593 3.6320 2.5945 2.6788 1.7622 3.5036 3.5919 2.0486 4.8744 1.2472 3.5643 3.0801 1.4360 1.4584 2.8604 1.8595 2.0323 1.1538 2.8509 1.4639 2.2151 2.9150 2.3863 2.8204 3.0478 2.4703 2.6460 3.1477 2.5296 2.2597 2.5080 3.2278 2.1471 2.5851 2.1431 2.6538 2.0498 1.3298 1.4840 1.5503 1.3354 1.3222 1.8734 1.8396 1.5933 1.7057 1.8088 2.1056 1.5458 1.4265 1.4171 1.3078 1.1673 1.2087 1.3263 1.3484 1.5598 1.4592 1.5832 1.5641 1.9590 1.3572 1.4010 2.6815 1.1769 1.7561 1.1693 1.1560 1.1064 2.2108 1.0835 2.0608 1.1114 1.7299 7.2564 6.4166 1.0862 1.1547 8.9353 1.1115 1.0675 1.0600 1.0622 1.0600 1.0627 1.0616 1.0790 1.0983 1.0846 1.0995 1.0986 1.1031 1.0996 1.1036 1.0975 1.0986 1.0765 1.0466 1.0463 1.0942 1.0641 1.0785 1.0991
irintensity: 1.0531 0.6386 3.6728 5.7284 1.5143 2.3483 6.1656 1.4287 0.0555 1.8771 4.7291 0.6002 1.7449 5.1093 1.6119 5.6175 4.0192 5.7542 1.3899 13.0146 10.3998 5.5447 0.7295 1.3082 2.3348 4.9781 3.9521 31.8692 32.1709 4.3760 36.6927 4.3596 82.4328 15.0700 16.7970 8.8958 4.5771 40.9646 56.1154 187.3649 14.5488 14.7355 154.5988 5.9975 10.6145 4.8184 2.8440 42.2053 13.7799 7.3906 18.6780 79.2934 47.3267 23.5419 36.6963 68.9288 7.9420 25.9510 5.9469 11.9106 9.6794 7.0957 0.0434 113.2338 130.7832 33.2292 35.7727 27.7777 27.3068 13.5387 18.3200 16.6317 0.0811 39.0804 73.0045 37.7343 9.0019 16.7355 83.5744 24.9856 5.9303 4.4072 3.6481 9.0742 10.7705 1.8778 13.2521 0.6917 10.0069 14.3510 37.0052 27.9132 19.3993 10.4397 16.8557 6.4809 5.6379 7.0474 17.5364 223.2584 437.0483 6.2257 29.9220 44.2863 8.6912 2.7052 134.3277 14.3224 38.2832 112.8063 287.5531 53.5725 24.2960 214.4394 1572.8079 31.2215 15.5308 22.1089 25.4265 17.6381 16.8906 27.0214 28.1278 4.5878 12.6767 29.6937 11.4727 19.1151 63.2889 12.4682 2.7430 137.8048 0.1307 2.9063 2.9080 29.8555 22.6514 11.4078
temp: 298.150 k
press: 1.00000 atm
elementType: 8 8 8 8 7 7 7 7 7 7 6 6 6 6 6 6 6 6 6 6 6 6 6 6 1 1 1 1 1 1 1 1 1 1 1 1 1 1 1 1 1 1 1 1 1 1 1 1
symmnumber: 1
zpe: 1036044.0 jmol-1
zpe.correction: 0.394608 hartree
zpe.thermalcorrener: 0.419314 hartree
zpe.thermalcorrenthalpy: 0.420258 hartree
zpe.thermalcorrgfe: 0.338071 hartree
zpe.sumelectzpe: -1175.469883 hartree
zpe.sumelectthermal: -1175.445177 hartree
zpe.sumelectthermalent: -1175.444233 hartree
zpe.sumelectthermalfe: -1175.526420 hartree
dipole: -0.9102 2.5132 -2.0155
dipole: 3.3476
quadrupole: -122.5751 -158.4744 -138.2529
quadrupole: -12.6380 -7.4723 18.5652
quadrupole: 17.1924 -18.7069 1.5145 -12.6380 -7.4723 18.5652
hfenergy: -1175.8644912 hartree
pointgroup: C01 [X(C14H24N6O4)]
dipole: 0.5772879 0.7744154 0.8953533 debye
polarizability: 238.9429683|5.500922|204.1972546|-6.7767904|25.235856|162.073178 unknown
InChI: InChI=1S/C14H24N6O4/c15-4-2-1-3-10(14(23)24)13(22)20-11(19-12(21)6-16)5-9-7-17-8-18-9/h7-8,10-11,18-20,23H,1-6,15-16H2
charge 0 multiplicity 1
48 atoms
O  0.800031 -1.571473 -1.765231
O  1.485412 -4.457229 -0.572834
O  3.539894 -3.384534 -0.469331
O  -3.800769 -1.975627 -0.865176
N  -0.482674 -0.934025 0.058742
N  -2.722249 -0.076682 -0.000054
N  0.562952 2.670961 0.183134
N  3.10922 2.37185 -1.060268
N  -0.893735 3.746683 1.557486
N  -4.816157 0.719113 1.475798
C  2.427866 -1.271478 1.21225
C  1.514304 -2.311295 0.497984
C  3.169249 -0.323253 0.242837
C  -1.48978 -0.2028 -0.759114
C  3.697396 0.952546 0.931604
C  -0.96455 1.183355 -1.24579
C  0.575041 -1.600727 -0.51574
C  4.191421 2.00738 -0.082529
C  -0.714722 2.200658 -0.159634
C  2.315084 -3.389578 -0.225095
C  -3.786646 -0.946399 -0.1273
C  -1.594344 2.884757 0.70051
C  -5.008061 -0.543739 0.734227
C  0.403613 3.591566 1.20947
H  0.889813 -2.833307 1.249594
H  3.154442 -1.812083 1.847794
H  1.791173 -0.667251 1.889276
H  2.461159 -0.026903 -0.552619
H  3.989752 -0.872665 -0.253678
H  -1.689046 -0.83194 -1.64697
H  2.889046 1.401898 1.542522
H  4.528106 0.706682 1.622666
H  -1.715463 1.568604 -1.961515
H  -0.042114 0.989078 -1.821306
H  -0.651726 -0.986774 1.065018
H  -2.901156 0.724432 0.627506
H  4.47842 2.930019 0.454728
H  5.099471 1.633181 -0.602557
H  1.494199 2.465229 -0.293141
H  -2.682321 2.836639 0.737045
H  3.290043 3.28303 -1.503724
H  3.011055 1.658397 -1.796827
H  -5.213231 -1.39299 1.413212
H  -5.872317 -0.490762 0.045974
H  1.236542 4.124425 1.663246
H  2.001758 -5.124734 -1.100427
H  -5.407368 1.497554 1.178314
H  -4.770232 0.634406 2.493022
