program: Gaussian 09
title: 000192505
version: EM64L-G09RevD.01
frameworkgroup: C1[X(C7H7NO5)]
method: RPBEPBE
basis: SDD
operation: Freq
keyword: #pfreq=noraman
keyword: PBEPBE/SDD
title: #p freq=noraman PBEPBE/SDD
converged: YES YES NO NO
title: Mulliken charges:
elementType: O O O O O N C C C C C C C H H H H H H H
charge: -0.209843 -0.373337 -0.432871 -0.237391 -0.223231 -0.661991 0.453127 -0.417499 -0.199455 0.077170 -0.303311 0.117485 0.158858 0.259586 0.321426 0.242829 0.330072 0.332620 0.381899 0.383856
chargesum: 0.00000
title: Mulliken charges with hydrogens summed into heavy atoms:
elementType: O O O O O N C C C C C C C
charge: -0.209843 0.008562 -0.049015 -0.237391 -0.223231 0.000701 0.453127 -0.157913 0.121971 0.077170 -0.060482 0.117485 0.158858
polarizability: 1.96455691e+02 9.35603465e+00 1.18724480e+02 -2.37545683e+00 -1.83753041e+00 4.48508802e+01
1716.lowfreq: -6.3934 -1.8438 0.0006 0.0008 0.0008 8.0552 29.3427 38.3325 43.4114
frequency: 29.3174 38.3172 43.4078 67.9526 131.5781 150.1332 161.6419 182.0333 236.8878 269.3430 333.8064 365.5621 436.0808 444.6616 463.8017 509.3742 521.0912 543.3168 574.0427 606.7448 630.3919 642.0927 643.6420 711.2560 769.5385 861.5028 886.0774 890.8601 896.4967 947.3923 992.6521 1016.3676 1058.5210 1077.1330 1131.3501 1228.1830 1271.5187 1306.3642 1321.3979 1373.3173 1423.6692 1556.1224 1581.9047 1614.6396 1635.1343 1643.1137 1654.0136 3133.8366 3137.6010 3147.8325 3507.5352 3526.4070 3540.9496 3681.0033
redmass: 7.6261 12.8289 9.2093 8.8550 3.5871 5.3267 4.7525 4.3318 4.8279 5.3311 8.6503 6.1242 3.8687 3.7051 1.1903 3.5299 2.1135 1.8083 2.1240 3.7129 1.7678 2.4282 1.6368 5.9358 5.4700 5.8813 2.6108 3.7262 1.6884 4.1227 1.1524 2.3473 2.1340 1.9102 1.6618 1.3221 1.3949 2.1058 2.0801 2.7027 3.0717 11.2763 5.0815 9.8106 4.7132 1.5823 3.7023 1.0895 1.0974 1.0871 1.0641 1.0642 1.0456 1.1037
irintensity: 0.2532 0.0467 8.2835 0.1524 1.1337 1.4477 0.7018 2.3695 3.2127 6.0667 3.5233 10.7260 11.9861 56.5948 50.1775 11.2612 47.0769 127.1278 90.5502 21.0434 167.4962 121.4057 89.8294 34.7444 7.2638 71.1740 23.4433 22.7692 48.9711 47.9688 57.7740 295.1689 256.2071 195.8508 6.7039 5.1380 52.4737 49.4697 46.9958 12.8978 48.7141 282.2563 368.3449 165.3891 94.0453 333.5267 20.3522 7.8899 10.2288 7.7101 41.5300 56.7166 92.0155 28.3024
temp: 298.150 k
press: 1.00000 atm
elementType: 8 8 8 8 8 7 6 6 6 6 6 6 6 1 1 1 1 1 1 1
symmnumber: 1
zpe: 362162.9 jmol-1
zpe.correction: 0.137941 hartree
zpe.thermalcorrener: 0.151251 hartree
zpe.thermalcorrenthalpy: 0.152195 hartree
zpe.thermalcorrgfe: 0.095894 hartree
zpe.sumelectzpe: -700.840002 hartree
zpe.sumelectthermal: -700.826692 hartree
zpe.sumelectthermalent: -700.825747 hartree
zpe.sumelectthermalfe: -700.882048 hartree
dipole: 1.7026 5.4377 0.1178
dipole: 5.6993
quadrupole: -60.1732 -70.9510 -76.1284
quadrupole: 7.5370 -1.1716 2.4077
quadrupole: 8.9110 -1.8668 -7.0442 7.5370 -1.1716 2.4077
hfenergy: -700.9779426 hartree
pointgroup: C01 [X(C7H7N1O5)]
dipole: -0.6806377 2.0685257 0.534489 debye
dipolederiv: -0.4074544 -0.2697462 -0.0791022 0.4383817 -0.9194388 -0.0835786 0.1339873 -0.2070867 -0.3353933 -0.6588867 0.5300061 0.1402423 0.5554056 -0.9935184 -0.1184183 0.1500033 -0.122935 -0.4134867 -1.5396275 0.1973173 0.1648514 0.1191333 -0.3280897 0.0511439 0.1673196 0.0577484 -0.4136574 -0.960172 -0.1321686 -0.1608185 0.0748549 -0.7547399 -0.1446632 -0.0672714 -0.1760821 -0.3919619 -0.689635 -0.0549335 -0.0223259 -0.1782536 -0.706631 -0.3333804 -0.0883573 -0.2846154 -0.5531996 -0.5388065 0.2995923 0.1881766 0.4877897 -1.2101113 -0.0603877 0.3294815 -0.1866159 -0.5928707 0.8781237 -0.6563807 -0.088838 -0.4266967 1.1518237 0.1709593 -0.1736198 0.2110244 0.1804565 -1.0814402 0.8181485 0.0976118 0.4633515 -0.6215027 -0.0097193 -0.019528 0.0772919 -0.2617694 0.3833874 -0.0788351 0.0250549 0.0088805 -0.1101451 0.0262682 0.156268 -0.0735173 -0.0313659 0.8028544 -0.0182274 0.0798427 -0.8863808 1.1723058 0.0954818 -0.1639994 0.2643149 0.2289096 -0.8111693 -0.1718691 -0.1924725 -0.3017346 -0.0937688 0.0560811 -0.2387304 0.0824614 -0.127799 1.2644018 -0.3592131 0.0642447 -0.5539612 1.3941667 0.3230888 -0.0590385 0.3426473 0.3485604 2.1400442 0.0390724 -0.0178521 0.5137668 0.8463416 0.5097779 0.1883857 0.4280021 0.6076717 0.105691 -0.067725 -0.0310911 -0.0568324 0.0117646 -0.0572132 -0.0035828 -0.0606458 0.1590579 0.1513466 0.0296619 0.0278443 -0.0431919 0.1004353 -0.051533 -0.0224437 -0.0370564 0.1435508 0.1029543 0.0061308 0.0200286 0.0036285 -0.0051634 -0.1196522 0.0105708 -0.1030686 0.0989925 0.1077294 0.0324517 -0.0660046 -0.0235282 0.2701742 -0.0355986 -0.0776012 -0.021291 0.3474277 0.2032185 -0.0336796 -0.0658519 0.0079865 0.2593194 -0.038839 -0.0856981 -0.0220754 0.3183486 0.1579401 -0.072608 -0.0659936 -0.134749 0.3310447 -0.0482524 -0.0879653 -0.0362234 0.3745383 0.3895001 -0.0369947 -0.017547 -0.0678506 0.2057329 -0.131565 -0.04818 -0.1322772 0.31399 unknown
polarizability: 194.0938301|-14.4178268|111.0604073|15.9932556|21.7880909|54.876813 unknown
InChI: InChI=1S/C7H7NO5/c8-4(1-2-6(10)11)3-5(9)7(12)13/h1-3,10,12H,8H2
charge 0 multiplicity 1
20 atoms
O  1.192198 -1.473294 -0.176578
O  3.884468 -1.664624 0.105125
O  -4.757997 -0.144621 -0.357315
O  3.997636 0.515435 0.891216
O  -3.169491 -1.48578 -1.414924
N  -0.550264 2.518534 0.622427
C  -0.128846 1.242264 0.298875
C  1.214202 0.887285 0.474143
C  -1.135505 0.30519 -0.236426
C  1.791221 -0.418395 0.208322
C  -2.485835 0.466249 -0.093786
C  3.323747 -0.444233 0.442393
C  -3.4364 -0.494557 -0.696781
H  1.919717 1.644645 0.836553
H  -0.74615 -0.58041 -0.751314
H  -2.941424 1.268331 0.498433
H  0.100558 3.189102 1.027056
H  -1.480239 2.845783 0.371622
H  4.865372 -1.633971 0.278021
H  -5.38297 -0.802234 -0.766562
