program: Gaussian 09
title: 000192501
version: EM64L-G09RevD.01
frameworkgroup: C1[X(C13H15ClN4O4S)]
method: RPBEPBE
basis: SDD
operation: Freq
keyword: #p
keyword: freq=noraman
keyword: PBEPBE/SDD
title: #p freq=noraman PBEPBE/SDD
converged: YES YES NO NO
title: Mulliken charges:
elementType: Cl S O O O O N N N N C C C C C C C C C C C C C H H H H H H H H H H H H H H H
charge: -0.069969 0.985459 -0.059872 -0.126174 -0.515746 -0.541750 -0.190822 -0.240374 -0.048185 -0.044263 -0.167140 -0.464770 -0.341597 -0.486162 0.454678 -0.094381 -0.040255 -0.370764 -0.292749 0.200848 -0.225681 -0.608181 -0.604420 0.317217 0.262393 0.250903 0.250155 0.268602 0.251267 0.251037 0.256734 0.300566 0.273414 0.249336 0.209157 0.285547 0.223519 0.242425
chargesum: 0.00000
title: Mulliken charges with hydrogens summed into heavy atoms:
elementType: Cl S O O O O N N N N C C C C C C C C C C C C C
charge: -0.069969 0.985459 -0.059872 -0.126174 -0.515746 -0.541750 -0.190822 -0.240374 -0.048185 -0.044263 0.150077 0.048527 0.177160 0.016142 0.454678 -0.094381 -0.040255 -0.114030 -0.292749 0.200848 0.074885 0.123726 0.147070
polarizability: 3.43338989e+02 -3.51083615e+00 2.26695555e+02 8.23848975e+00 -9.37279168e+00 1.51647053e+02
1716.lowfreq: -6.4267 -3.5521 -0.0014 -0.0012 -0.0004 8.1239 17.9141 26.9944 31.2813
frequency: 17.7506 26.8961 31.2795 37.9590 49.8685 76.2625 85.0970 105.5814 124.8232 128.1725 167.1512 172.6772 190.4837 200.4649 204.2471 205.8393 213.4473 226.8569 231.5891 245.6299 258.5090 291.3166 308.6497 347.9226 360.8578 372.4536 386.9056 387.3221 401.9050 444.3832 474.4058 518.3879 545.2188 555.5926 572.0780 572.9946 619.1515 632.5489 643.3162 683.8255 725.3586 780.4788 800.2528 809.3388 823.7808 832.7077 845.9129 857.3474 865.0664 873.1583 898.4892 924.5089 932.7186 947.5606 956.3754 970.8140 981.2934 1019.3656 1057.4092 1080.5322 1093.0403 1095.1243 1107.4418 1149.9250 1154.2828 1175.7096 1179.3034 1182.5775 1209.0887 1236.1945 1253.7443 1269.2390 1291.7833 1304.9091 1310.9143 1320.2950 1327.6861 1355.2576 1398.3863 1409.5852 1421.1318 1449.0448 1453.8059 1459.6734 1468.9625 1470.5208 1473.2303 1476.2791 1484.7985 1489.6490 1554.1913 1588.1234 1752.3820 2918.7602 2947.3919 3004.9044 3026.1524 3029.4165 3041.0211 3043.5312 3046.4048 3076.9570 3097.1211 3097.8113 3100.5437 3109.2301 3142.2177 3166.5702
redmass: 4.5603 9.2695 6.7246 6.7286 5.0538 4.6363 5.2904 3.8035 5.0841 4.6238 4.2617 3.8067 4.6959 6.1782 3.1450 1.3081 3.3790 1.7038 4.1503 4.8171 3.0138 4.3380 5.5732 6.0407 6.6997 6.3814 14.5683 3.7452 5.1529 11.5741 6.0769 7.2772 7.8702 3.1387 7.2828 6.3705 4.4636 5.3237 5.3951 3.9508 10.6057 6.2609 6.9770 8.1871 1.9010 2.9237 12.0877 4.3095 1.8325 4.1983 2.5687 2.5451 3.3964 10.7514 15.1997 1.4183 2.1379 1.4183 2.4433 1.2279 1.7678 2.2374 1.3664 1.8365 1.8908 5.1300 2.0296 1.6367 1.7073 1.2118 1.3783 1.9980 6.9952 1.3137 1.4524 1.8652 1.4221 1.5787 4.9082 1.1288 1.1343 6.5240 1.0814 1.0526 1.0877 1.0476 1.0571 1.0927 1.0949 5.3096 7.8444 7.7062 11.2257 1.0466 1.0392 1.0632 1.0667 1.0625 1.0859 1.0838 1.0957 1.1006 1.0990 1.1018 1.0984 1.1050 1.0895 1.0932
irintensity: 1.3019 0.4699 0.4067 2.4447 2.1628 2.0799 1.1108 1.2053 1.6914 0.2977 0.8997 0.8109 2.2157 0.5986 1.3608 0.5502 1.6982 4.1041 3.2669 0.4446 1.3870 6.7959 2.4540 5.4273 5.2338 30.6943 27.2376 11.2641 9.3543 140.5659 83.4869 12.3211 16.5415 6.9085 7.2593 22.9719 24.9751 5.8160 4.5257 117.8367 8.0939 4.2758 16.1502 54.8677 64.7421 51.0626 17.9221 46.5822 55.1517 23.2079 21.8640 21.4586 40.3421 14.4131 59.9175 2.2328 6.1292 0.6543 11.2548 0.0986 5.7179 12.2739 22.8578 7.6739 40.6723 10.8040 51.7605 8.5761 22.2727 2.6497 23.7327 0.4874 67.1645 0.5223 0.9300 21.4540 3.9695 23.8695 189.5402 21.7147 7.0484 96.4419 22.9457 10.1089 22.0681 9.1937 60.3549 19.5107 4.6752 10.7729 492.0535 135.9342 200.0871 53.3236 46.7915 17.1884 8.4735 19.8867 19.4642 15.7233 36.3335 5.7575 2.8303 15.2109 1.3790 19.2445 4.6178 21.9833
temp: 298.150 k
press: 1.00000 atm
elementType: 17 16 8 8 8 8 7 7 7 7 6 6 6 6 6 6 6 6 6 6 6 6 6 1 1 1 1 1 1 1 1 1 1 1 1 1 1 1
symmnumber: 1
zpe: 719653.1 jmol-1
zpe.correction: 0.274101 hartree
zpe.thermalcorrener: 0.297293 hartree
zpe.thermalcorrenthalpy: 0.298237 hartree
zpe.thermalcorrgfe: 0.219171 hartree
zpe.sumelectzpe: -1880.429322 hartree
zpe.sumelectthermal: -1880.406130 hartree
zpe.sumelectthermalent: -1880.405186 hartree
zpe.sumelectthermalfe: -1880.484252 hartree
dipole: 6.8907 3.7685 7.1317
dipole: 10.6087
quadrupole: -149.1171 -164.5138 -152.5465
quadrupole: 3.1234 -9.5232 -2.6072
quadrupole: 6.2753 -9.1213 2.8460 3.1234 -9.5232 -2.6072
hfenergy: -1880.7034231 hartree
pointgroup: C01 [X(C13H15Cl1N4O4S1)]
dipole: -2.8995121 0.751136 -2.9067338 debye
polarizability: 343.0934066|8.8259174|227.6679256|-2.8129654|-7.4546957|150.9202646 unknown
InChI: InChI=1S/C13H15ClN4O4S/c1-17(2)23(20,21)10-6-5-8(11-12(10)16-22-15-11)18-7-3-4-9(18)13(14)19/h5-6,9H,3-4,7H2,1-2H3
charge 0 multiplicity 1
38 atoms
Cl -4.657302 -2.981745 0.640553
S  3.483302 -1.087837 0.508463
O  -3.683169 -0.798405 2.004452
O  1.063756 2.981017 -0.338121
O  4.063499 -0.17416 1.716408
O  3.375214 -2.707251 0.615893
N  -2.475796 0.389533 -0.392648
N  4.603543 -0.767927 -0.971187
N  -0.270254 2.458186 -0.40273
N  2.046711 1.938821 -0.117273
C  -3.500869 -0.655458 -0.488606
C  -4.749576 0.104369 -1.031757
C  -3.057514 1.765196 -0.463592
C  -4.582981 1.519352 -0.426688
C  -1.138295 0.082996 -0.219825
C  -0.118571 1.119217 -0.221697
C  -3.831279 -1.269109 0.888664
C  -0.665533 -1.239746 -0.050652
C  1.698696 -0.555205 0.13575
C  1.300797 0.799623 -0.044663
C  0.717058 -1.541831 0.12722
C  4.06243 -1.399489 -2.193167
C  5.014256 0.650177 -1.081453
H  -3.199578 -1.478853 -1.15894
H  -5.695203 -0.388785 -0.756823
H  -4.68252 0.132964 -2.133683
H  -2.734749 2.261681 -1.397386
H  -2.702159 2.380785 0.379016
H  -5.133161 2.284605 -0.996926
H  -4.948833 1.539017 0.614636
H  -1.36908 -2.076022 -0.023196
H  1.031788 -2.579869 0.286199
H  3.744437 -2.428952 -1.958184
H  4.890232 -1.457782 -2.922851
H  3.221686 -0.837611 -2.659525
H  5.185569 1.052699 -0.069516
H  4.279999 1.294606 -1.608445
H  5.975647 0.665893 -1.62732
