program: Gaussian 09
title: 000192491
version: EM64L-G09RevD.01
frameworkgroup: C1[X(C19H20N4O2)]
method: RPBEPBE
basis: SDD
operation: Freq
keyword: #p
keyword: freq=noraman
keyword: PBEPBE/SDD
title: #p freq=noraman PBEPBE/SDD
converged: YES YES NO NO
title: Mulliken charges:
elementType: O O N N N N C C C C C C C C C C C C C C C C C C C H H H H H H H H H H H H H H H H H H H H
charge: -0.436095 -0.234142 -0.214976 -0.138381 -0.047859 -0.105127 -0.432685 -0.352661 -0.570466 0.235865 -0.333886 0.501341 0.353017 -0.439101 -0.374168 0.272725 -0.368431 -0.397647 -0.724505 0.070858 -0.385685 -0.326321 -0.226408 -0.229622 0.073784 0.235664 0.207126 0.224358 0.229600 0.266342 0.229199 0.191879 0.188003 0.229390 0.259510 0.242639 0.249845 0.208955 0.264296 0.205047 0.257531 0.279244 0.237174 0.239763 0.385010
chargesum: 0.00000
title: Mulliken charges with hydrogens summed into heavy atoms:
elementType: O O N N N N C C C C C C C C C C C C C C C C C C C
charge: -0.051085 -0.234142 -0.214976 -0.138381 -0.047859 -0.105127 0.010105 0.101297 -0.074925 0.235865 0.045996 0.501341 0.353017 -0.209711 -0.114657 0.272725 -0.125792 -0.147802 -0.046206 0.070858 -0.128155 -0.047076 0.010766 0.010141 0.073784
polarizability: 3.21571054e+02 6.86344104e+00 2.36376969e+02 -5.47354251e+00 1.85447147e+01 1.61469152e+02
1716.lowfreq: -11.7508 -2.2097 -0.0005 -0.0003 0.0006 3.9279 13.4624 19.7786 33.1258
frequency: 11.5143 18.1169 33.0190 41.2876 54.1635 59.0342 67.9855 85.4169 89.3395 94.1321 114.5294 135.6875 156.2057 189.9025 213.4744 236.2719 241.8659 257.1271 275.8182 287.3950 317.0377 344.2644 375.4832 392.9997 399.8681 405.3578 420.1101 430.3785 510.5885 530.1495 553.2536 590.7661 596.4423 604.5863 631.0396 658.4160 677.7363 682.7519 699.3046 714.9029 731.9927 754.9163 758.4383 763.8761 777.9890 790.3996 791.4976 812.6302 841.8159 852.2084 878.4618 897.2580 900.2604 913.6358 924.1046 959.8207 974.9072 978.5834 991.0288 998.1561 1001.1392 1003.0035 1008.2045 1018.8827 1024.5867 1051.6977 1068.2791 1070.9634 1109.4381 1113.5812 1123.1774 1134.1926 1158.7077 1179.6389 1184.2335 1196.5551 1212.0397 1229.0472 1258.9418 1262.6448 1269.0912 1279.5352 1289.1200 1291.7808 1304.6980 1309.4362 1319.4457 1333.8227 1350.1715 1371.1988 1376.9508 1387.0528 1396.2251 1410.6997 1428.2298 1445.1231 1461.1396 1467.6080 1473.7424 1479.1171 1484.2813 1488.5606 1498.4132 1513.2335 1568.7866 1580.9140 1602.6231 1623.6409 1638.7167 2960.3801 2975.5178 2988.0936 2998.2721 3006.2022 3016.4433 3045.0702 3065.4504 3071.5869 3073.6399 3088.1640 3118.0623 3126.9102 3134.1146 3145.8042 3148.5820 3151.4684 3163.5350 3183.3274 3524.5936
redmass: 4.9151 4.7461 6.6914 7.6088 4.4998 4.0329 4.9061 2.3500 3.7778 3.4114 2.2991 5.3265 5.7677 7.6452 3.5347 3.9904 3.5028 1.3203 2.9086 4.6138 4.6689 4.5585 4.8000 2.6474 4.9266 2.9592 3.5608 3.8970 4.7042 3.9485 3.3842 1.5226 4.0197 3.5045 6.1419 7.8886 4.5293 6.6017 4.2266 2.9866 1.1748 3.0746 3.7825 4.1371 2.3278 1.5093 2.3124 3.9326 1.7962 1.2921 3.5516 1.4829 1.8692 2.2380 1.8041 1.4159 1.4427 1.3977 5.0656 5.4034 6.4839 1.3600 3.7789 3.4455 2.9626 2.2321 2.4223 1.6946 2.1148 1.7560 1.8735 2.6364 1.7841 1.0666 2.7254 1.1382 2.3573 1.8985 1.3043 1.7673 1.4249 1.3582 2.2120 1.0885 2.4036 1.3235 1.3855 1.7218 1.5385 5.1180 4.6795 3.0019 1.2034 2.8688 2.2300 1.2091 1.1492 1.0698 2.3932 1.0893 1.1050 3.3601 1.0599 2.8927 6.6211 7.0320 6.2219 6.3321 8.6578 1.0586 1.0367 1.0599 1.0607 1.1000 1.0595 1.1010 1.0996 1.1034 1.1034 1.1004 1.0883 1.0880 1.0862 1.0958 1.0917 1.0968 1.0969 1.0969 1.0642
irintensity: 1.2840 0.7056 3.1147 0.6270 0.9845 1.0080 1.9549 0.3044 1.9504 0.7698 0.2121 0.7298 0.5733 0.1744 1.3180 1.2589 0.4513 0.3293 0.1026 2.8937 1.0509 6.2497 3.6510 1.0281 0.9420 1.3096 7.3274 3.8006 4.3415 13.6872 18.3651 70.2172 15.3858 37.6548 1.6240 6.6154 21.8717 5.8823 37.8176 11.9629 9.4875 38.0803 24.2306 9.7668 12.2334 3.7761 25.2830 5.3206 29.3890 6.8265 5.4089 0.5097 7.4679 9.5872 9.1958 1.6739 24.0556 3.0464 164.8135 93.6119 6.5576 2.1260 9.4788 7.3000 2.3149 16.9175 2.7316 4.8484 16.0056 35.4716 18.6704 15.8487 70.6165 0.3182 0.4772 0.9719 1.5131 2.6681 4.5717 4.9120 6.2769 2.2941 6.4893 2.8272 56.9564 9.8457 3.3721 15.6466 0.1410 16.9963 10.6420 23.6525 11.0641 7.7238 3.3724 1.0846 27.0328 0.7523 51.5691 9.3932 7.7405 33.1713 10.4196 2.5209 12.5417 9.8578 7.0935 0.6073 323.9477 36.3512 35.3228 1.8226 42.0669 23.8144 20.4903 4.7318 38.0823 53.4629 5.2562 27.6402 13.4252 7.6028 1.9178 15.0630 13.7122 0.2673 18.1424 9.5700 39.1301
temp: 298.150 k
press: 1.00000 atm
elementType: 8 8 7 7 7 7 6 6 6 6 6 6 6 6 6 6 6 6 6 6 6 6 6 6 6 1 1 1 1 1 1 1 1 1 1 1 1 1 1 1 1 1 1 1 1
symmnumber: 1
zpe: 935044.5 jmol-1
zpe.correction: 0.356140 hartree
zpe.thermalcorrener: 0.379132 hartree
zpe.thermalcorrenthalpy: 0.380076 hartree
zpe.thermalcorrgfe: 0.300103 hartree
zpe.sumelectzpe: -1103.649875 hartree
zpe.sumelectthermal: -1103.626883 hartree
zpe.sumelectthermalent: -1103.625938 hartree
zpe.sumelectthermalfe: -1103.705912 hartree
dipole: 7.2183 1.2804 4.3768
dipole: 8.5382
quadrupole: -163.7394 -138.6304 -146.9644
quadrupole: -13.6131 -24.8630 0.3367
quadrupole: -13.9613 11.1477 2.8137 -13.6131 -24.8630 0.3367
hfenergy: -1104.0060149 hartree
pointgroup: C01 [X(C19H20N4O2)]
dipole: -2.2781078 -2.4631321 -0.165084 debye
polarizability: 307.7327319|20.9605256|203.6155841|23.1814704|48.9459308|208.0688588 unknown
InChI: InChI=1S/C19H20N4O2/c1-2-3-8-18-20-21-22-23(18)13-14-9-11-15(12-10-14)16-6-4-5-7-17(16)19(24)25/h4-7,9-12,24H,2-3,8,13H2,1H3
charge 0 multiplicity 1
45 atoms
O  -2.204939 -2.961839 -2.679899
O  -0.563545 -1.550534 -1.861258
N  3.511101 0.994916 2.178451
N  4.915268 2.074203 0.837498
N  3.653764 2.296913 2.709625
N  4.505778 2.930638 1.882539
C  4.392398 -0.31699 0.152019
C  3.450551 -0.247922 -1.085295
C  2.612243 0.036285 2.843968
C  4.280567 0.88409 1.041015
C  3.643981 -1.460662 -2.022622
C  1.27712 -0.136152 2.128168
C  -1.242239 -0.462533 0.824633
C  0.788457 -1.427396 1.816173
C  0.490228 0.993414 1.793774
C  -2.593464 -0.6220 0.203583
C  -0.455846 -1.589513 1.174536
C  -0.754648 0.829777 1.154336
C  2.714341 -1.39932 -3.254006
C  -2.857489 -1.403785 -0.967979
C  -3.69687 -0.011403 0.857104
C  -4.195835 -1.589186 -1.411903
C  -5.019155 -0.178316 0.394824
C  -5.273789 -0.984468 -0.737905
C  -1.755441 -1.938278 -1.820837
H  5.43891 -0.37859 -0.197634
H  4.180036 -1.240752 0.724154
H  3.658589 0.689652 -1.63561
H  2.395238 -0.202016 -0.754427
H  2.46295 0.438801 3.861308
H  3.13075 -0.934294 2.938447
H  4.703188 -1.506475 -2.349982
H  3.447043 -2.395426 -1.457854
H  1.381022 -2.313389 2.076295
H  0.857766 1.999686 2.027078
H  -0.823066 -2.596653 0.949175
H  -1.34481 1.712175 0.88219
H  2.90845 -0.485948 -3.847378
H  1.65481 -1.386939 -2.942212
H  2.871927 -2.270424 -3.917246
H  -3.50822 0.575909 1.762165
H  -4.36894 -2.196312 -2.304024
H  -5.846238 0.305297 0.925962
H  -6.29764 -1.131578 -1.096636
H  -1.445704 -3.237262 -3.261115
