program: Gaussian 09
title: 000192490
version: EM64L-G09RevD.01
frameworkgroup: C1[X(C21H20O7)]
method: RPBEPBE
basis: SDD
operation: Freq
keyword: #pfreq=noraman
keyword: PBEPBE/SDD
title: #p freq=noraman PBEPBE/SDD
converged: YES YES NO NO
title: Mulliken charges:
elementType: O O O O O O O C C C C C C C C C C C C C C C C C C C C C H H H H H H H H H H H H H H H H H H H H
charge: -0.265946 -0.298854 -0.485513 -0.422346 -0.364119 -0.458192 -0.429137 0.305112 0.426128 0.068581 -0.647194 0.098725 0.120086 0.212544 -0.500537 -0.584625 0.158050 0.137395 0.153752 -0.304338 0.023824 -0.399150 0.112364 0.388075 -0.311612 -0.792477 -0.783748 -0.519797 0.223495 0.236429 0.270427 0.265387 0.230883 0.261022 0.258786 0.225745 0.218975 0.220151 0.226435 0.223272 0.222559 0.378468 0.388545 0.279497 0.216978 0.228377 0.398149 0.389367
chargesum: 0.00000
title: Mulliken charges with hydrogens summed into heavy atoms:
elementType: O O O O O O O C C C C C C C C C C C C C C C C C C C C C
charge: -0.265946 -0.298854 -0.107045 -0.033800 -0.364119 -0.060043 -0.039770 0.305112 0.426128 0.068581 -0.187270 0.098725 0.120086 0.212544 -0.230110 -0.319238 0.158050 0.137395 0.153752 -0.073455 0.023824 -0.138128 0.112364 0.388075 -0.052826 -0.127606 -0.111482 0.205054
polarizability: 4.18725147e+02 -6.70347424e+00 2.37209254e+02 -9.02844657e+00 -3.59780743e+01 1.92753703e+02
1716.lowfreq: -18.7964 -4.9774 0.0006 0.0007 0.0007 2.0252 4.7358 22.2825 31.7801
frequency: -18.5321 22.1448 31.7677 51.1810 55.7146 59.6094 70.5656 93.7530 98.1160 114.4721 137.8205 143.1331 158.2820 160.3601 176.4788 193.5956 206.6097 219.6242 234.1204 248.6903 262.8828 266.2378 275.7735 279.3655 292.0705 302.7361 319.6461 363.1332 371.9598 373.9232 381.8396 410.4908 426.9859 436.5233 440.3158 450.4961 464.3406 489.4291 502.6055 514.2756 516.0023 522.3503 535.1192 563.4288 596.3424 599.7159 611.0858 632.6341 653.2922 675.4303 694.5295 717.5494 737.4700 747.5126 763.2947 782.2729 795.1843 801.7174 806.2770 837.0623 851.2546 874.3092 884.0564 924.1673 930.7347 942.7915 943.5928 947.5337 992.1340 1014.1264 1017.7003 1023.1084 1072.7654 1080.9045 1106.6774 1109.5621 1111.7651 1144.3743 1146.3778 1158.9726 1163.3654 1173.5783 1175.1586 1203.7771 1212.6464 1222.8763 1233.8293 1246.1569 1276.1697 1300.5853 1315.9271 1330.3988 1340.2969 1358.7708 1379.2748 1389.2912 1399.6602 1399.8931 1415.2004 1426.9414 1439.9704 1448.3471 1451.2418 1453.7360 1458.4769 1462.9392 1464.8006 1470.4048 1473.2675 1483.8291 1501.4392 1540.8204 1553.3300 1597.1237 1602.4334 1627.7235 1649.0826 1688.1380 2697.4136 2958.0993 2966.4496 2977.1162 2981.6980 3029.8984 3034.9994 3062.1614 3077.6229 3085.4040 3094.5252 3095.5416 3135.4623 3150.1502 3157.1462 3165.5706 3184.7073 3500.1741 3518.2160 3623.4746
redmass: 3.1875 4.7410 6.3560 5.6900 3.6295 4.3411 4.7212 2.3647 1.1233 5.8556 2.6129 8.4141 3.7928 1.4829 1.5538 4.4236 4.0742 4.5875 4.6737 4.2794 4.5640 5.5477 1.3241 3.4611 4.4088 4.9059 2.4981 5.2475 8.6093 8.2821 3.9047 3.8471 4.8481 3.7327 3.3883 4.5910 4.0489 7.3780 1.4491 2.7952 1.1577 2.5782 7.4549 5.2687 4.5852 6.9070 8.4307 6.6803 5.7149 7.2780 7.3163 5.1336 5.2559 4.8733 8.3357 1.6830 7.1555 5.7537 1.4383 1.9918 1.6748 3.9302 1.5506 9.1560 1.3362 1.8970 1.0802 1.3947 1.2488 3.3927 4.7339 2.4710 3.3025 1.6706 2.1599 1.2688 2.4737 2.4020 1.6265 1.2923 1.8920 1.3663 1.3882 2.7814 2.1241 2.5097 1.9992 3.4681 1.5298 1.6303 2.5141 4.3213 2.6452 1.4242 2.8764 1.2923 3.7630 1.2919 3.9473 1.4168 3.7908 3.8820 1.1364 1.1021 1.0858 1.0728 4.3732 1.0516 1.0809 1.0669 4.2812 4.7953 4.7315 6.9449 5.9387 7.0973 5.4586 6.4465 1.0706 1.0371 1.0389 1.0678 1.0328 1.0968 1.0964 1.0902 1.0979 1.0903 1.0998 1.0958 1.1054 1.0920 1.0921 1.0886 1.0971 1.0648 1.0648 1.0666
irintensity: 0.0861 0.1751 0.2062 1.0995 0.2358 1.3322 1.5281 5.0342 0.2409 0.4873 0.5890 1.3046 0.2517 0.4878 1.7351 4.8557 2.7594 3.3953 8.4648 2.9972 25.9219 10.2831 122.0293 15.8515 2.8259 6.3707 10.8995 2.6245 2.2021 12.0244 4.2027 0.7827 5.8514 8.2260 5.0171 12.2602 18.4987 1.7073 88.8896 35.9199 127.7317 33.2492 15.2407 50.2209 9.1176 4.1958 18.2675 2.3661 13.0924 6.5438 1.6511 8.1887 7.5738 6.8529 5.0863 16.0749 65.1396 19.1989 54.5404 9.8717 16.9642 14.0757 29.7011 13.7882 1.0082 36.4959 119.6941 3.1976 5.6475 65.6839 26.5877 11.2572 208.5526 4.4144 26.3738 5.6670 49.8653 144.9780 78.5964 8.7972 79.9568 224.1294 75.2207 79.5923 135.9566 1.3049 158.2513 61.2944 92.9180 142.3535 323.4184 67.2045 254.1145 0.9912 81.1850 26.9614 7.7164 11.8084 89.8802 8.0579 20.7628 398.8654 31.8732 11.1837 6.3182 13.2934 112.2748 53.2606 11.7424 25.8940 143.2912 26.5678 123.0528 118.6298 30.2562 50.3384 67.9449 6.4806 407.7490 32.4207 36.1908 33.4047 64.3699 11.3598 44.4280 4.1746 11.7840 30.7425 29.6405 33.3186 9.8588 4.6382 6.0159 2.5498 2.0021 86.9559 148.5264 65.1056
temp: 298.150 k
press: 1.00000 atm
elementType: 8 8 8 8 8 8 8 6 6 6 6 6 6 6 6 6 6 6 6 6 6 6 6 6 6 6 6 6 1 1 1 1 1 1 1 1 1 1 1 1 1 1 1 1 1 1 1 1
symmnumber: 1
zpe: 955774.3 jmol-1
zpe.correction: 0.364035 hartree
zpe.thermalcorrener: 0.390285 hartree
zpe.thermalcorrenthalpy: 0.391229 hartree
zpe.thermalcorrgfe: 0.308322 hartree
zpe.sumelectzpe: -1336.749670 hartree
zpe.sumelectthermal: -1336.723420 hartree
zpe.sumelectthermalent: -1336.722476 hartree
zpe.sumelectthermalfe: -1336.805384 hartree
dipole: 2.3545 -0.1445 0.9322
dipole: 2.5364
quadrupole: -175.7991 -153.6930 -158.4749
quadrupole: -17.3285 -0.6309 0.2275
quadrupole: -13.1434 8.9627 4.1808 -17.3285 -0.6309 0.2275
hfenergy: -1337.1137052 hartree
pointgroup: C01 [X(C21H20O7)]
dipole: 0.9541054 -0.1092763 -0.2712367 debye
polarizability: 411.5647574|42.2672121|184.2129135|6.7848054|-17.9718639|252.9104332 unknown
InChI: InChI=1S/C21H20O7/c1-10(2)4-5-11-8-14(23)15(24)9-12(11)20-21(27-3)19(26)17-16(28-20)7-6-13(22)18(17)25/h4,6-9,22-25H,5H2,1-3H3
charge 0 multiplicity 1
48 atoms
O  -0.279008 0.582625 0.929063
O  0.81418 0.587443 -2.598444
O  4.916198 2.770748 -1.019016
O  6.058696 1.292732 0.930785
O  -2.07955 0.391075 -2.842177
O  -4.381976 0.282146 -1.734328
O  -5.875028 0.27877 0.582673
C  1.961967 0.680668 0.08294
C  2.604063 -0.105016 1.094815
C  0.521953 0.560405 -0.219316
C  1.898205 -1.245758 1.828957
C  -2.290115 0.416953 -0.450648
C  -0.04868 0.508624 -1.497526
C  -1.67845 0.492753 0.828994
C  2.712799 1.64314 -0.649925
C  3.975384 0.121789 1.35665
C  -1.49419 0.438016 -1.673342
C  4.068192 1.844229 -0.369568
C  4.710146 1.089555 0.646985
C  1.464391 -2.357086 0.879631
C  -3.710645 0.348687 -0.524014
C  -2.434661 0.497776 2.014395
C  -4.483335 0.348112 0.662051
C  0.324464 -3.104933 0.935583
C  -3.843019 0.423697 1.919232
C  0.06341 -4.193379 -0.094281
C  -0.755577 -2.958407 1.992475
C  0.663721 -0.469586 -3.633148
H  2.605977 -1.658925 2.575344
H  1.032005 -0.862585 2.393669
H  2.218173 2.219065 -1.438628
H  4.497961 -0.468978 2.115283
H  2.187889 -2.580688 0.080658
H  -1.934428 0.567164 2.983233
H  -4.464519 0.428191 2.819193
H  0.887672 -4.274004 -0.824157
H  -0.062417 -5.181217 0.392033
H  -0.874407 -3.995374 -0.651214
H  -0.575843 -2.118954 2.682973
H  -1.747917 -2.807227 1.524077
H  -0.829418 -3.8837 2.598226
H  4.448771 3.264357 -1.734192
H  6.410136 2.003422 0.330776
H  -0.340537 -0.420279 -4.082646
H  0.843728 -1.464712 -3.184367
H  1.442778 -0.244201 -4.376603
H  -3.645493 0.313818 -2.471568
H  -6.132046 0.244949 -0.378287
