program: Gaussian 09
title: 000192470
version: EM64L-G09RevD.01
frameworkgroup: C1[X(C24H19N3)]
method: RPBEPBE
basis: SDD
operation: Freq
keyword: #pfreq=noraman
keyword: PBEPBE/SDD
title: #p freq=noraman PBEPBE/SDD
converged: YES YES NO NO
title: Mulliken charges:
elementType: N N N C C C C C C C C C C C C C C C C C C C C C C C C H H H H H H H H H H H H H H H H H H H
charge: -0.144274 -0.326484 -0.101124 -0.354140 0.335956 0.384931 0.153752 -0.401908 -0.592127 -0.373669 0.374927 -0.386317 0.314848 0.374926 -0.172729 -0.436251 -0.212073 -0.425101 -0.359752 -0.405854 -0.395342 -0.409640 -0.244947 -0.243357 -0.259089 -0.234964 -0.248219 0.250260 0.286757 0.272941 0.250952 0.269451 0.312347 0.283858 0.238781 0.261326 0.242709 0.249987 0.240020 0.253965 0.234457 0.229387 0.229489 0.228272 0.224317 0.228746
chargesum: 0.00000
title: Mulliken charges with hydrogens summed into heavy atoms:
elementType: N N N C C C C C C C C C C C C C C C C C C C C C C C C
charge: -0.144274 -0.014137 -0.101124 -0.103879 0.335956 0.384931 0.153752 -0.115151 -0.319186 -0.122717 0.374927 -0.116866 0.314848 0.374926 0.111129 -0.197470 0.049253 -0.182391 -0.109765 -0.165834 -0.141378 -0.175183 -0.015560 -0.013868 -0.030818 -0.010646 -0.019474
polarizability: 3.25418380e+02 1.93889345e+01 2.68262224e+02 -5.57772795e+00 8.47744936e+00 2.42423548e+02
1716.lowfreq: -7.2959 -4.0872 -1.4780 -0.0007 -0.0005 0.0003 19.1021 21.1817 39.3556
frequency: 19.0566 21.1269 39.3543 45.7865 47.3185 67.1904 71.7417 89.9297 115.9589 143.9248 182.6176 193.3365 206.4044 249.2075 267.3734 276.8036 301.0084 336.9761 368.1191 394.8073 408.2098 411.9606 452.8406 481.9345 506.8658 512.4288 532.5080 546.0783 578.3095 615.7742 619.5390 624.9583 632.1512 647.6192 655.2266 665.8138 673.9622 706.0842 731.1622 738.0851 748.2155 758.5291 763.5210 775.8382 783.9102 787.6626 796.5557 801.1043 806.2500 838.6267 842.9256 856.2691 878.7826 881.5150 893.7109 902.6704 923.5486 935.8862 956.0415 964.0048 977.9477 980.8552 983.8599 991.1136 993.4454 995.7997 1006.8963 1023.5445 1032.4494 1048.7653 1075.5481 1083.1077 1105.0207 1122.1037 1132.7490 1154.5038 1167.8585 1172.2045 1174.3464 1179.5306 1193.8172 1205.7249 1224.5070 1229.4834 1249.7447 1254.8259 1257.2187 1273.8115 1291.7085 1313.3245 1324.5253 1329.6868 1353.8019 1364.3564 1372.1575 1394.7371 1412.2711 1425.2351 1431.4542 1433.5155 1437.6900 1447.3566 1466.4595 1466.8583 1474.9148 1512.1424 1530.3445 1563.6350 1583.5893 1585.3631 1606.8568 1616.6825 1642.0039 2976.9379 3119.8612 3120.7494 3120.9699 3125.4589 3128.2165 3132.7205 3141.0701 3143.0180 3144.1927 3150.4956 3162.6360 3164.2588 3222.7879 3230.7219 3231.0776 3235.5018 3252.4223 3610.8764
redmass: 5.8639 4.7466 4.6851 4.8126 4.8379 4.6058 4.8448 5.2131 4.5693 4.9308 3.7802 5.2053 5.2052 5.3940 4.5546 5.1875 5.0849 6.0344 5.7517 3.1503 3.0313 4.0115 4.7197 2.5416 4.3697 5.9163 3.7836 5.1963 1.7234 5.8012 3.6474 2.7776 2.3799 3.6318 3.1942 4.2282 2.6119 1.8880 2.0149 1.2719 1.3937 2.8679 2.8576 1.4640 2.5192 2.7247 1.7670 2.9481 3.1417 1.4921 1.4431 1.2495 2.7033 2.4995 4.6088 4.2102 1.4720 1.5701 3.4520 1.4636 1.6305 1.4223 3.2461 3.9214 1.3546 1.4140 3.9331 2.2554 2.0139 1.5906 1.7249 1.7381 1.8048 1.8247 1.9200 1.6977 1.2508 1.0585 1.1117 1.3367 1.1214 1.9937 1.8436 2.3407 1.4554 2.0256 2.0700 1.8311 2.5916 1.7291 3.8176 2.0358 2.0578 2.1789 5.4131 2.9276 5.5187 3.2319 2.4510 3.2324 2.4693 2.7436 2.7063 4.0253 2.3197 3.6072 4.7511 5.1126 7.0983 6.1115 5.5710 6.1495 6.7675 1.0827 1.0865 1.0863 1.0847 1.0892 1.0873 1.0908 1.0926 1.0951 1.0972 1.0956 1.1003 1.1014 1.0914 1.0967 1.0971 1.1008 1.1088 1.0817
irintensity: 0.3677 0.2494 0.0101 1.3472 1.6630 0.1751 0.6154 1.8727 3.2001 0.5350 2.0927 0.9070 2.0313 1.6873 1.5098 0.3310 0.3512 2.4016 4.3480 0.2302 0.1250 0.1533 3.0538 19.8619 0.7170 0.2500 7.7090 0.5928 97.8272 0.5915 13.0251 8.3786 8.8925 0.4278 14.3897 6.2436 4.0503 37.3926 3.7336 21.1495 18.1583 30.0242 41.9124 77.0518 48.1849 2.3537 12.8748 66.6697 21.1852 17.4698 1.5448 0.9460 16.7399 8.4193 5.2726 2.3779 2.5968 6.7871 0.6051 3.8170 0.4121 3.6723 14.7335 2.5419 0.0254 0.1273 22.6264 3.5418 2.9716 52.9948 26.2843 25.3647 10.6794 17.7443 4.3059 4.2009 2.3656 0.3148 2.8393 8.6322 2.3419 57.0401 10.5669 1.0468 1.3608 3.4618 28.0339 9.1458 10.8018 3.9416 3.2256 2.1452 7.2012 11.6819 1.0963 11.2047 3.4722 0.2960 20.9329 1.4409 5.3177 44.2654 1.0516 4.8429 17.9170 12.8883 17.3996 5.0098 0.7795 0.5933 8.7663 24.1463 4.9837 6.2992 0.8028 6.6177 4.1682 0.4507 2.0374 2.6926 22.7990 18.1893 30.6152 23.6918 38.2816 24.0148 4.8252 0.1495 0.8193 0.4949 2.4415 81.1373
temp: 298.150 k
press: 1.00000 atm
elementType: 7 7 7 6 6 6 6 6 6 6 6 6 6 6 6 6 6 6 6 6 6 6 6 6 6 6 6 1 1 1 1 1 1 1 1 1 1 1 1 1 1 1 1 1 1 1
symmnumber: 1
zpe: 957972.8 jmol-1
zpe.correction: 0.364873 hartree
zpe.thermalcorrener: 0.386052 hartree
zpe.thermalcorrenthalpy: 0.386996 hartree
zpe.thermalcorrgfe: 0.312112 hartree
zpe.sumelectzpe: -1088.376314 hartree
zpe.sumelectthermal: -1088.355135 hartree
zpe.sumelectthermalent: -1088.354191 hartree
zpe.sumelectthermalfe: -1088.429075 hartree
dipole: -0.8973 -3.5023 3.5371
dipole: 5.0579
quadrupole: -139.9008 -178.5791 -137.0326
quadrupole: -6.5674 11.4315 13.4979
quadrupole: 11.9367 -26.7416 14.8049 -6.5674 11.4315 13.4979
hfenergy: -1088.741187 hartree
pointgroup: C01 [X(C24H19N3)]
dipole: -0.3951333 1.2815822 -1.4701246 debye
polarizability: 325.6108701|-18.984714|269.4597854|4.1911178|7.2321036|241.0334968 unknown
InChI: InChI=1S/C24H19N3/c1-2-7-19(8-3-1)22-15-26-16-23(22)24(27-13-12-25-17-27)21-11-10-18-6-4-5-9-20(18)14-21/h1-17,24,26H
charge 0 multiplicity 1
46 atoms
N  0.532668 -2.465433 0.772136
N  2.19995 -1.094721 -2.9176
N  1.270425 -4.488022 1.492527
C  0.567738 -1.012357 0.431593
C  1.322809 -0.769296 -0.86227
C  -0.857473 -0.435986 0.487862
C  2.234025 0.327412 -1.152678
C  1.327449 -1.625355 -1.970322
C  -1.470355 0.157051 -0.617336
C  -1.566993 -0.495592 1.737081
C  -2.794139 0.70523 -0.529957
C  2.758905 0.084786 -2.43551
C  2.608849 1.469665 -0.289304
C  -3.503945 0.639715 0.730909
C  -0.433318 -3.404731 0.382804
C  -2.852281 0.027396 1.854295
C  1.539575 -3.167657 1.429684
C  -3.435998 1.318659 -1.656062
C  0.035285 -4.64026 0.838044
C  -4.825578 1.187729 0.816964
C  1.664855 2.113641 0.560081
C  3.945072 1.964011 -0.297861
C  -4.725816 1.844598 -1.544034
C  -5.42674 1.778454 -0.297687
C  2.045111 3.204773 1.371526
C  4.321671 3.061809 0.503521
C  3.373718 3.686942 1.347913
H  1.146104 -0.534209 1.24941
H  0.821352 -2.575985 -2.119565
H  -0.931133 0.212224 -1.570133
H  -1.083851 -0.969631 2.599643
H  3.444892 0.680977 -3.03269
H  2.402894 -1.512431 -3.823187
H  -1.344968 -3.113668 -0.131539
H  -3.383896 -0.024894 2.811894
H  2.430133 -2.68391 1.824713
H  -2.897451 1.370778 -2.609911
H  -0.435887 -5.616298 0.74672
H  -5.360613 1.136622 1.772863
H  0.619456 1.787606 0.555233
H  4.69511 1.463526 -0.921421
H  -5.206982 2.311569 -2.410343
H  -6.437412 2.194538 -0.222975
H  1.298327 3.68598 2.01319
H  5.356694 3.421667 0.480579
H  3.666663 4.534982 1.976703
