program: Gaussian 09
title: 000192460
version: EM64L-G09RevD.01
frameworkgroup: C1[X(C13H21N5O)]
method: RPBEPBE
basis: SDD
operation: Freq
keyword: #p
keyword: freq=noraman
keyword: PBEPBE/SDD
title: #p freq=noraman PBEPBE/SDD
converged: YES YES NO NO
title: Mulliken charges:
elementType: O N N N N N C C C C C C C C C C C C C H H H H H H H H H H H H H H H H H H H H H
charge: -0.246239 -0.341712 -0.146395 -0.119370 -0.117344 -0.123704 -0.112184 -0.457730 -0.535882 0.014138 -0.372308 -0.371336 0.119953 -0.300898 -0.300235 0.050753 -0.450151 -0.366213 -0.684862 0.264022 0.241621 0.240160 0.238266 0.237942 0.325575 0.220182 0.272540 0.268645 0.220663 0.219656 0.197905 0.196931 0.218547 0.209950 0.213967 0.212294 0.220923 0.211611 0.211452 0.218864
chargesum: 0.00000
title: Mulliken charges with hydrogens summed into heavy atoms:
elementType: O N N N N N C C C C C C C C C C C C C
charge: -0.246239 -0.016137 -0.146395 -0.119370 -0.117344 -0.123704 0.151838 0.024051 -0.059674 0.014138 0.120414 0.117973 0.119953 0.116663 0.115244 0.050753 -0.026233 0.067004 -0.042935
polarizability: 2.20378385e+02 -3.84582389e+00 2.23206207e+02 8.32322780e+00 8.61794713e-01 1.20360939e+02
1716.lowfreq: -15.4768 -6.9235 -1.9561 -0.0008 -0.0006 -0.0006 6.4142 31.6893 40.5673
frequency: -13.7278 31.6769 40.5562 48.7132 54.8253 73.7009 81.6911 107.4079 146.7507 159.8346 189.7002 218.9310 233.3519 252.6921 263.5129 276.4632 301.2911 314.8038 352.5527 386.7536 403.4285 452.3274 472.4628 515.7997 534.0478 550.2406 589.6369 614.8465 665.4737 708.5498 714.0663 744.6504 757.9329 789.1807 804.7823 817.6797 822.8386 835.5951 848.0288 870.3992 887.4190 901.1753 902.8755 936.0580 958.8528 992.3745 1015.2060 1027.8042 1040.1566 1049.3532 1055.1268 1058.0620 1061.7321 1069.0216 1090.6113 1097.1613 1104.0246 1135.4944 1161.6426 1179.3561 1184.6126 1190.6880 1212.1394 1226.5786 1247.8976 1255.8961 1268.1778 1275.7074 1275.9191 1292.4480 1318.7187 1324.0862 1335.0928 1341.1892 1353.2326 1363.9068 1367.2766 1386.4336 1393.4069 1434.5246 1443.8452 1447.0027 1450.4684 1452.6040 1456.7449 1460.0773 1466.9628 1474.5070 1475.3389 1484.9586 1501.3360 1522.6286 1569.8571 2951.4258 2955.9000 2972.3096 2978.6001 2981.9992 2986.6286 3009.2676 3035.3474 3068.2138 3072.1672 3082.1657 3085.8758 3086.3839 3092.1215 3092.3545 3097.2081 3107.9487 3117.2243 3198.8160 3220.7751 3555.8025
redmass: 2.8309 3.5054 4.1245 3.0961 3.9017 1.7712 3.3719 4.0241 3.4235 7.5760 6.7626 1.2202 1.9191 3.5834 3.7366 3.0894 3.2140 3.0148 4.2520 3.2416 2.0905 2.7406 3.2911 4.9414 2.5319 1.3179 3.6951 2.3830 4.5567 8.5624 8.8763 1.1313 1.2164 4.3779 9.1992 1.5295 1.9108 1.6821 3.8232 1.3594 2.2955 6.7591 2.4205 3.0670 3.2058 2.7737 2.3112 2.2683 1.3309 2.6102 2.6523 2.0019 1.2214 2.9342 2.1442 1.2961 1.9254 2.3718 1.3908 2.5270 2.1528 1.2043 2.6550 1.6261 1.6124 1.6777 1.2995 1.3441 1.3480 1.4523 1.8688 1.2327 1.4910 1.2720 1.4695 1.2778 1.9647 1.2145 2.6291 1.0948 1.5427 1.2211 1.1161 1.0805 1.1886 1.4870 1.6663 1.0446 1.0735 1.0780 2.7777 7.0914 7.0007 1.0678 1.0679 1.0352 1.0658 1.0662 1.0599 1.0589 1.1005 1.1012 1.0991 1.0961 1.0973 1.1041 1.0961 1.0964 1.0533 1.0626 1.0884 1.1166 1.1156 1.0768
irintensity: 0.0909 0.0367 0.0470 0.5383 0.4520 0.0457 0.1288 0.1739 0.3893 5.0045 0.8768 0.2902 2.7258 8.5833 0.3620 1.1191 4.8798 2.4312 3.7697 3.8464 2.3132 1.3963 6.8373 17.4605 20.4172 63.9447 10.0355 10.1495 3.6260 3.7638 5.5174 4.9776 2.8595 18.4507 17.3158 5.6639 5.3672 0.2502 23.2159 6.8796 7.6825 19.7405 0.6009 12.5854 7.4843 32.4826 36.7155 0.4043 35.2956 38.2092 2.5551 9.4247 9.7464 19.2761 36.3315 1.7553 3.3451 6.5198 0.2137 3.2420 0.5807 1.7880 44.1501 41.5177 9.6123 14.9280 4.2771 24.5587 8.2769 98.6578 36.3007 0.7161 3.0408 5.6604 10.0748 5.4332 83.0817 8.7503 58.7700 4.4048 131.7782 27.0602 45.5912 8.9358 46.2595 128.7180 55.0776 7.7129 14.2848 15.8501 189.3839 1408.0080 249.9369 41.6558 51.3222 48.7413 5.8037 125.7269 15.5450 32.9037 0.5542 21.4822 48.5988 40.9312 48.9691 59.5140 4.2534 6.7765 18.2278 7.9650 15.1199 3.9690 24.0059 60.7279
temp: 298.150 k
press: 1.00000 atm
elementType: 8 7 7 7 7 7 6 6 6 6 6 6 6 6 6 6 6 6 6 1 1 1 1 1 1 1 1 1 1 1 1 1 1 1 1 1 1 1 1 1
symmnumber: 1
zpe: 883881.7 jmol-1
zpe.correction: 0.336653 hartree
zpe.thermalcorrener: 0.354687 hartree
zpe.thermalcorrenthalpy: 0.355632 hartree
zpe.thermalcorrgfe: 0.289068 hartree
zpe.sumelectzpe: -855.477948 hartree
zpe.sumelectthermal: -855.459913 hartree
zpe.sumelectthermalent: -855.458969 hartree
zpe.sumelectthermalfe: -855.525533 hartree
dipole: -0.1152 1.9562 0.3859
dipole: 1.9972
quadrupole: -119.6149 -101.6227 -112.8872
quadrupole: 4.1319 1.3009 1.3949
quadrupole: -8.2400 9.7522 -1.5123 4.1319 1.3009 1.3949
hfenergy: -855.8146008 hartree
pointgroup: C01 [X(C13H21N5O1)]
dipole: 0.2510985 0.7297909 -0.147585 debye
polarizability: 222.8388502|3.8926483|221.0356815|6.1138576|-1.9978491|120.0709987 unknown
InChI: InChI=1S/C13H21N5O/c1-2-3-11-15-12(14-10-4-5-10)17-13(16-11)18-6-8-19-9-7-18/h10,14H,2-9H2,1H3
charge 0 multiplicity 1
40 atoms
O  -4.684306 -0.87108 0.276813
N  1.783256 2.260182 -0.075551
N  -1.924393 -0.621929 -0.457563
N  -0.115979 0.87793 -0.279245
N  2.084965 -0.02297 0.298084
N  0.186414 -1.519588 0.098077
C  1.064853 3.457048 -0.440356
C  0.350452 4.289373 0.637172
C  1.650108 4.801503 -0.008599
C  1.218134 1.009114 -0.018921
C  -2.545184 -1.959214 -0.388524
C  -2.860387 0.481861 -0.746276
C  -0.586373 -0.413521 -0.207239
C  -3.713557 -1.929483 0.61641
C  -4.020173 0.445476 0.269511
C  1.507222 -1.260022 0.338453
C  2.409466 -2.433444 0.636436
C  3.206545 -2.878652 -0.622687
C  4.159078 -4.053912 -0.318539
H  0.571414 3.4048 -1.416916
H  0.407704 3.921237 1.66484
H  -0.594713 4.768577 0.368322
H  1.596449 5.634327 -0.714566
H  2.554429 4.79138 0.60887
H  2.793313 2.287297 0.073757
H  -2.93013 -2.231229 -1.39215
H  -1.770583 -2.682558 -0.088523
H  -2.303727 1.430713 -0.690551
H  -3.264904 0.355436 -1.770907
H  -4.286109 -2.871005 0.586449
H  -3.322374 -1.763752 1.64357
H  -3.635219 0.677716 1.28621
H  -4.80729 1.168253 -0.001655
H  3.125362 -2.1414 1.426501
H  1.793371 -3.273298 1.002381
H  2.492009 -3.16719 -1.417974
H  3.780684 -2.011712 -1.00157
H  4.895203 -3.775282 0.458876
H  3.600337 -4.935893 0.047348
H  4.718933 -4.35899 -1.221669
