program: Gaussian 09
title: 000017813
version: EM64L-G09RevD.01
frameworkgroup: C1[X(C11H8N2O)]
method: RPBEPBE
basis: SDD
operation: Freq
keyword: #p
keyword: freq=noraman
keyword: PBEPBE/SDD
title: #p freq=noraman PBEPBE/SDD
converged: YES YES NO NO
title: Mulliken charges:
elementType: O N N C C C C C C C C C C C H H H H H H H H
charge: -0.272382 0.002694 -0.033825 0.343330 0.228100 -0.361096 -0.347247 -0.263190 -0.215701 -0.300027 0.258397 -0.534653 -0.257172 -0.180228 0.237712 0.249240 0.240129 0.236330 0.238249 0.228897 0.227580 0.274864
chargesum: 0.00000
title: Mulliken charges with hydrogens summed into heavy atoms:
elementType: O N N C C C C C C C C C C C
charge: -0.272382 0.002694 -0.033825 0.343330 0.228100 -0.123383 -0.098007 -0.023062 0.020629 -0.061777 0.258397 0.196688 -0.257172 -0.180228
polarizability: 2.32509389e+02 6.11804113e+00 1.51537950e+02 -2.74099533e+00 3.20236102e+00 6.06503516e+01
1716.lowfreq: -10.2464 -6.6511 -3.5109 -0.0007 -0.0003 0.0003 14.1273 68.0441 91.8724
frequency: 13.6877 68.0403 91.8677 112.9745 146.2133 171.9030 178.7501 210.0655 255.0822 262.2886 320.0518 334.2213 420.6688 425.3512 469.6872 492.2692 545.6742 560.7511 602.1179 622.5492 648.7172 727.4493 743.3583 759.2769 781.4277 854.8921 866.1599 928.5194 956.0660 977.1509 983.8465 1044.6309 1109.7710 1113.1075 1144.4642 1160.6653 1178.3608 1230.2681 1250.7613 1273.8365 1371.2082 1407.5801 1422.9072 1442.4396 1462.9387 1471.1911 1486.9588 1569.7001 1590.0708 1603.8011 2160.6713 2171.0116 2976.2023 3073.1916 3103.6832 3129.3101 3141.2890 3143.0454 3165.5071 3176.8795
redmass: 7.7738 5.3664 4.0108 4.5058 6.9949 3.5557 4.5035 1.7033 4.0372 3.4834 8.1455 3.8376 7.3244 5.9079 5.1839 4.2401 4.3970 4.7658 12.1492 6.9600 6.8971 4.9569 3.7982 1.3002 5.4846 1.4576 5.8007 1.3880 1.4530 8.7097 1.3474 2.1772 2.1157 1.4755 2.0184 1.4896 1.0788 3.1214 3.1129 1.6029 2.6538 2.4234 1.6415 1.4955 1.0918 1.0535 2.2504 7.2603 6.0795 6.1022 12.6280 12.6378 1.0319 1.1051 1.0880 1.0888 1.0990 1.0904 1.0933 1.0996
irintensity: 1.4737 0.3760 4.7752 3.3529 2.8021 4.3874 3.8568 3.3731 1.1230 1.3991 1.2146 3.3401 1.7424 1.2117 4.1376 4.2368 0.9834 4.7220 0.2890 11.3239 1.8643 3.1009 2.2894 93.6760 1.1183 2.2224 5.3954 7.7791 13.8864 41.8415 0.1140 3.8480 7.8539 2.3762 24.4804 2.3974 6.5888 36.2210 91.5484 28.2491 20.5131 18.1757 8.3610 13.9124 58.2677 14.4950 50.3986 110.2819 34.7739 103.3630 9.5037 49.8403 51.4614 32.5439 6.5381 4.7017 6.3575 2.7155 15.6843 17.4334
temp: 298.150 k
press: 1.00000 atm
elementType: 8 7 7 6 6 6 6 6 6 6 6 6 6 6 1 1 1 1 1 1 1 1
symmnumber: 1
zpe: 419330.2 jmol-1
zpe.correction: 0.159714 hartree
zpe.thermalcorrener: 0.172612 hartree
zpe.thermalcorrenthalpy: 0.173556 hartree
zpe.thermalcorrgfe: 0.118919 hartree
zpe.sumelectzpe: -607.661395 hartree
zpe.sumelectthermal: -607.648497 hartree
zpe.sumelectthermalent: -607.647553 hartree
zpe.sumelectthermalfe: -607.702190 hartree
dipole: -7.9981 -0.0007 -0.5248
dipole: 8.0153
quadrupole: -94.7384 -73.2665 -84.2832
quadrupole: -0.5555 -1.0855 -4.1415
quadrupole: -10.6424 10.8296 -0.1872 -0.5555 -1.0855 -4.1415
hfenergy: -607.8211093 hartree
pointgroup: C01 [X(C11H8N2O1)]
dipole: -3.1275417 0.1273117 0.3827632 debye
dipolederiv: -0.2002026 0.3564247 0.1680785 -0.1858397 -1.1941457 -0.4428546 -0.0776995 -0.4349615 -0.4750046 -0.4662963 -0.0192857 -0.0250477 -0.0831823 -0.2231536 0.0090002 -0.0987396 0.0101674 -0.2202451 -0.2654616 0.0088359 0.0279041 0.1103319 -0.2650679 -0.028021 0.1723744 -0.0206209 -0.2938186 -0.7895131 -0.0758377 -0.0064261 0.1685626 -0.2088534 -0.092683 -0.064959 -0.1085497 -0.0712344 0.1888094 -0.676026 -0.3190409 0.1109953 0.8531185 0.2925674 0.1497009 0.2640876 0.2115527 0.4442805 0.0768244 0.0591813 -0.3064693 0.0519984 0.1094613 -0.212917 0.1097403 -0.054486 -0.1196905 0.4122491 0.2110001 0.0628569 -0.2151568 -0.0113483 0.036153 0.0486491 -0.1658142 -0.4830913 -0.1597457 -0.0777888 -0.3055135 -0.0845512 0.0668795 -0.1788932 0.0358318 -0.1559899 0.1015377 -0.0328859 0.022808 0.2395546 0.18792 0.1612219 0.1680799 0.166946 -0.0159599 1.2113205 -0.0698598 -0.1300803 -0.2064988 0.0198836 0.0840796 -0.0995662 0.0617696 0.0157217 -0.4813883 0.0341578 0.0735005 0.3573871 0.1418631 0.0179007 0.2797985 0.0327512 0.165522 0.2375171 0.2282393 0.1177415 0.1808088 0.6495195 0.1757501 0.1025934 0.2273546 0.4155467 0.5024831 0.0729202 0.0870638 0.1262169 -0.0214819 -0.0584466 0.1607611 -0.0610768 -0.0484813 0.0447735 -0.0026376 -0.0800177 -0.1465693 0.1094253 0.0425559 -0.2514659 0.0433836 0.1611515 0.0438363 -0.0870067 -0.0659601 -0.0468407 0.0226414 -0.0784663 -0.0414462 -0.0797892 0.0991501 0.0568163 -0.0432949 -0.0298355 -0.0764077 0.0058111 -0.0923787 -0.0541105 -0.0826992 0.1182176 0.0210908 0.0745335 0.0342753 0.0894883 0.0000974 -0.098018 0.0443211 -0.0967395 0.118109 -0.1067339 0.017016 -0.0116599 0.0135832 0.1097865 -0.0256992 -0.0244318 -0.0286954 0.1350921 0.059866 0.002487 -0.0103507 -0.1092318 0.0379632 -0.0914336 -0.0165232 -0.0821731 0.04263 0.0070749 -0.0461512 -0.1327291 0.0420245 -0.0118122 0.0801776 -0.0823316 -0.0045645 -0.0610888 -0.0332768 -0.1869325 0.0289083 -0.0673393 -0.0220322 0.0110563 0.0768199 0.0537293 -0.0167692 0.0262482 0.1159757 0.0584754 0.0320822 0.056227 -0.0313011 0.0124814 -0.0545407 0.0961983 unknown
polarizability: 230.4271173|-12.4269402|119.4141926|-7.1879399|44.9827712|94.8563816 unknown
InChI: InChI=1S/C11H8N2O/c1-14-11-5-3-2-4-10(11)6-9(7-12)8-13/h2-6H,1H3
charge 0 multiplicity 1
22 atoms
O  -0.514121 -1.63943 -0.358454
N  4.416079 0.553694 1.025564
N  2.067013 -1.700117 -1.841249
C  -0.538483 0.472015 0.744789
C  -1.274782 -0.580856 0.099897
C  -1.291443 1.534342 1.334143
C  -2.685963 -0.522551 0.001232
C  -2.692362 1.595059 1.242078
C  -3.387037 0.564631 0.563629
C  0.910467 0.545199 0.873109
C  1.97611 -0.076868 0.229713
C  -1.138928 -2.705409 -1.152363
C  3.311095 0.270556 0.662834
C  1.954391 -0.983274 -0.88903
H  -0.746303 2.332653 1.852036
H  -3.237933 -1.324832 -0.496366
H  -3.239232 2.429713 1.690233
H  -4.47891 0.599588 0.482887
H  1.235245 1.279372 1.625059
H  -1.668401 -2.286301 -2.027897
H  -1.832625 -3.300724 -0.529961
H  -0.296175 -3.323958 -1.490984
