program: Gaussian 09
title: 000192442
version: EM64L-G09RevD.01
frameworkgroup: C1[X(C23H26N2OS)]
method: RPBEPBE
basis: SDD
operation: Freq
keyword: #p
keyword: freq=noraman
keyword: PBEPBE/SDD
title: #p freq=noraman PBEPBE/SDD
converged: NO YES NO NO
title: Mulliken charges:
elementType: S O N N C C C C C C C C C C C C C C C C C C C C C C C H H H H H H H H H H H H H H H H H H H H H H H H H H
charge: 0.229221 -0.216389 -0.078742 -0.012473 0.022423 -0.460198 -0.453290 -0.386909 -0.387441 -0.431742 -0.477632 -0.553928 0.449053 0.105976 0.299433 -0.379546 -0.449681 -0.397815 -0.336891 -0.229697 -0.222185 -0.246836 -0.386120 -0.362519 0.357362 -0.101228 -0.734602 0.184314 0.196806 0.209275 0.206653 0.195371 0.233948 0.172652 0.168660 0.211641 0.216371 0.222673 0.220697 0.189410 0.233867 0.248732 0.265357 0.231146 0.294877 0.252390 0.223821 0.223266 0.226205 0.259871 0.246439 0.246097 0.261858
chargesum: 0.00000
title: Mulliken charges with hydrogens summed into heavy atoms:
elementType: S O N N C C C C C C C C C C C C C C C C C C C C C C C
charge: 0.229221 -0.216389 -0.078742 -0.012473 0.206737 -0.054117 -0.051266 0.019691 -0.007140 0.007302 -0.067525 -0.071329 0.449053 0.105976 0.299433 -0.114189 -0.218535 -0.102938 -0.084501 -0.005876 0.001080 -0.020631 -0.386120 -0.102648 0.357362 -0.101228 0.019792
polarizability: 4.03259617e+02 3.06304786e+00 2.54437089e+02 -1.55909107e+01 2.10122973e+01 2.09294185e+02
1716.lowfreq: -15.4719 -3.3029 -0.0019 -0.0017 -0.0013 2.0015 8.8475 12.1667 23.3329
frequency: 8.4860 11.9183 22.3883 30.4333 37.9938 49.9264 67.8234 73.3582 85.1255 99.4720 114.8405 140.4155 150.9918 177.7870 192.5429 197.7281 224.7543 229.1227 242.5911 270.1777 285.4083 316.9380 326.8552 342.5376 370.5483 382.1038 406.9124 427.1658 431.9637 447.2182 459.7331 487.3740 490.7270 495.3603 514.3284 516.7518 550.5938 564.8035 588.6467 605.3147 617.9952 626.1395 653.3621 695.4318 705.5154 737.0818 747.4101 759.3891 776.4927 790.4628 805.7970 808.3095 831.6734 845.4695 860.4332 860.9876 909.4505 924.9521 937.7683 964.7142 970.2217 971.5293 980.0138 983.2603 984.6548 989.9096 994.0027 998.9081 1014.7257 1026.4539 1030.3718 1032.8379 1035.5849 1072.8493 1077.2929 1093.0551 1105.9138 1114.3697 1120.6478 1132.1694 1137.8399 1142.0560 1161.5492 1169.4557 1177.6497 1180.6381 1195.9232 1211.7683 1214.4212 1235.8262 1251.2286 1264.1733 1269.1303 1279.3994 1281.5108 1291.0549 1306.8849 1311.6632 1318.7328 1335.2886 1340.6985 1353.6751 1359.6353 1365.7012 1368.0020 1380.3107 1394.4778 1394.7165 1419.2503 1433.0700 1439.8877 1447.8784 1449.3355 1453.6346 1455.3208 1455.6950 1457.7824 1465.5826 1469.7416 1477.9354 1482.9094 1539.5571 1563.1778 1583.6880 1594.0753 1614.7096 1616.6602 2811.4237 2820.0707 2841.4786 2926.5932 2958.6394 2973.1835 2977.3556 2983.0809 2987.3397 2991.7295 3008.8444 3018.2513 3033.9631 3039.2670 3040.1375 3050.1105 3072.3087 3111.2185 3118.3737 3122.0908 3135.1620 3146.7252 3153.9584 3160.8210 3160.9785 3175.8795
redmass: 6.1290 5.5143 3.6968 6.1683 4.1369 3.4397 4.5760 3.9365 1.1375 4.1152 2.6557 4.2867 3.4604 3.8795 4.2362 5.5555 2.8158 2.7273 2.4014 4.5110 3.9023 2.4785 4.6529 1.9993 5.2048 4.4839 2.8554 2.1637 3.0884 3.6291 3.0277 5.0828 3.7795 3.6374 5.3825 5.3209 4.2113 5.0725 3.6181 2.9913 5.7443 2.8103 5.7775 6.5240 2.2124 1.7543 2.2193 3.6762 2.7144 2.6912 1.5762 3.5794 1.8745 1.8310 1.3075 4.3742 1.5777 1.6314 1.4097 1.4164 2.0651 1.5197 1.6130 1.3858 2.4112 5.9170 2.9235 1.4488 2.1305 2.1055 2.5904 2.8003 1.4342 2.3134 1.8029 1.9095 2.1429 2.2374 2.0481 1.5630 2.7525 1.7512 1.6178 1.0623 1.6545 1.1154 1.6898 2.1300 1.3747 2.3257 1.3387 1.5668 1.3696 1.6246 1.2885 1.3305 1.4404 1.4083 1.2955 1.3129 1.5056 1.5568 1.7671 1.5545 3.5558 2.8958 1.2556 1.9580 4.5337 1.1640 2.0829 1.6471 1.5981 1.1103 1.0444 1.0927 1.1177 1.0877 1.0957 1.1590 2.0109 6.4972 6.1266 8.7432 6.1696 6.1378 7.9089 1.0720 1.0709 1.0700 1.0818 1.0612 1.0594 1.0606 1.0857 1.0607 1.0371 1.0956 1.0865 1.1019 1.0996 1.0908 1.1015 1.0976 1.0869 1.0991 1.0861 1.0915 1.0954 1.0877 1.0924 1.1013 1.0970
irintensity: 0.2823 0.2331 0.1803 0.5888 0.0797 0.3317 2.7289 0.1018 1.0027 1.3782 1.9220 0.1034 3.8819 3.0709 0.0501 0.4303 2.0621 2.7386 3.1022 8.2960 2.1869 0.5766 0.9379 5.7146 0.5091 4.1061 0.2670 1.2070 5.2732 12.7483 2.2050 1.8453 6.8906 0.8620 1.8170 4.6300 0.3718 36.3377 2.2982 3.0804 0.3654 4.1955 3.2000 19.7601 32.3677 54.8258 6.9676 1.5898 33.7885 12.9542 1.9502 3.8674 16.1842 14.0962 0.8989 6.4539 2.1674 8.1767 12.8299 6.0918 46.8235 4.8715 7.2035 0.1494 7.2845 0.0761 4.9684 0.7803 15.9618 13.2145 0.8601 6.7643 2.5406 5.8739 14.1004 4.0718 5.9365 10.1892 29.5710 4.7399 92.8323 4.2688 3.5908 0.3499 6.1293 2.6830 151.2201 15.2311 14.1202 14.3567 2.1298 160.7051 9.1002 3.8326 13.6890 15.3148 50.9958 36.0124 11.9086 13.0269 5.2608 40.1697 0.0803 1.2119 19.7666 4.8672 22.0292 1.3489 70.4770 5.2956 11.7803 7.1795 0.8939 26.5372 20.7178 4.1184 8.0236 22.2697 4.1741 7.8179 12.6535 98.0734 18.9492 132.2650 0.9266 7.6568 2.3053 41.7240 70.8008 179.0003 25.9089 23.3587 40.8605 28.4092 18.7868 28.1558 12.6311 4.7442 65.5483 33.8187 19.6197 34.3235 81.6792 9.5764 9.1465 5.4123 0.2365 20.7907 32.8665 6.3216 3.1475 28.1949 7.5964
temp: 298.150 k
press: 1.00000 atm
elementType: 16 8 7 7 6 6 6 6 6 6 6 6 6 6 6 6 6 6 6 6 6 6 6 6 6 6 6 1 1 1 1 1 1 1 1 1 1 1 1 1 1 1 1 1 1 1 1 1 1 1 1 1 1
symmnumber: 1
zpe: 1142188.8 jmol-1
zpe.correction: 0.435037 hartree
zpe.thermalcorrener: 0.460285 hartree
zpe.thermalcorrenthalpy: 0.461229 hartree
zpe.thermalcorrgfe: 0.374920 hartree
zpe.sumelectzpe: -1472.876840 hartree
zpe.sumelectthermal: -1472.851592 hartree
zpe.sumelectthermalent: -1472.850648 hartree
zpe.sumelectthermalfe: -1472.936956 hartree
dipole: -1.0919 -1.7506 -1.9788
dipole: 2.8587
quadrupole: -144.4249 -171.4304 -165.7501
quadrupole: 6.8353 -5.3513 -5.1160
quadrupole: 16.1102 -10.8953 -5.2149 6.8353 -5.3513 -5.1160
hfenergy: -1473.3118763 hartree
pointgroup: C01 [X(C23H26N2O1S1)]
dipole: -0.4564958 0.7879355 0.6601086 debye
polarizability: 402.4234876|1.0131647|259.5241284|20.2386076|13.9125994|205.0432747 unknown
InChI: InChI=1S/C23H26N2OS/c1-17-24-21-9-8-20(15-23(21)27-17)22(26)10-7-18-11-13-25(14-12-18)16-19-5-3-2-4-6-19/h2-6,8-9,15,18H,7,10-14,16H2,1H3
charge 0 multiplicity 1
53 atoms
S  -7.649714 -0.562812 -0.957698
O  -2.495604 -2.60953 -0.75564
N  4.364029 -0.945467 0.58392
N  -7.094378 1.762944 0.295745
C  1.46251 -1.54998 0.728966
C  2.012522 -0.21124 0.177088
C  2.541717 -2.64528 0.541201
C  3.377447 0.14096 0.801315
C  3.890805 -2.228964 1.15726
C  0.126405 -1.9770 0.074149
C  5.717559 -0.584683 1.067232
C  -1.0244 -0.982229 0.314731
C  6.385114 0.510967 0.240365
C  -2.378803 -1.476239 -0.201982
C  -3.579931 -0.581233 -0.04218
C  6.237785 0.541405 -1.169725
C  7.204235 1.484382 0.86308
C  -4.822516 -1.048419 -0.548359
C  -3.503614 0.696441 0.591886
C  6.900259 1.522352 -1.939758
C  7.873562 2.464995 0.094528
C  7.723799 2.486891 -1.311045
C  -5.954041 -0.233775 -0.412231
C  -4.640574 1.510155 0.728949
C  -5.880657 1.051599 0.226492
C  -8.096916 1.107245 -0.249335
C  -9.512348 1.587555 -0.339103
H  1.292416 -1.42353 1.822858
H  1.309156 0.620083 0.378636
H  2.128504 -0.29224 -0.922385
H  2.685381 -2.830558 -0.541899
H  2.205632 -3.59566 1.000569
H  3.775194 1.068065 0.351115
H  3.23946 0.33763 1.899257
H  3.776387 -2.157566 2.272761
H  4.654946 -3.003614 0.955256
H  0.272439 -2.110319 -1.015949
H  -0.174989 -2.969992 0.459625
H  6.336332 -1.503722 1.010701
H  5.709892 -0.276209 2.145297
H  -1.12021 -0.765536 1.400101
H  -0.806856 -0.007023 -0.165658
H  5.588565 -0.205165 -1.640843
H  7.317933 1.476458 1.954837
H  -4.846764 -2.031785 -1.027857
H  -2.546872 1.055977 0.981585
H  6.777144 1.535722 -3.029049
H  8.504359 3.211388 0.591041
H  8.238751 3.247601 -1.908825
H  -4.592877 2.489393 1.213492
H  -9.842508 1.668114 -1.390811
H  -10.204582 0.894923 0.173181
H  -9.585984 2.579426 0.133813
