program: Gaussian 09
title: 000017810
version: EM64L-G09RevD.01
frameworkgroup: C1[X(C3HCl2N3)]
method: RPBEPBE
basis: SDD
operation: Freq
keyword: #p
keyword: freq=noraman
keyword: PBEPBE/SDD
title: #p freq=noraman PBEPBE/SDD
converged: YES YES YES YES
title: Mulliken charges:
elementType: Cl Cl N N N C C C H
charge: 0.067853 0.067860 0.127703 0.062786 0.062787 -0.208361 -0.208362 -0.247874 0.275608
chargesum: 0.00000
title: Mulliken charges with hydrogens summed into heavy atoms:
elementType: Cl Cl N N N C C C
charge: 0.067853 0.067860 0.127703 0.062786 0.062787 -0.208361 -0.208362 0.027734
polarizability: 1.06393469e+02 -1.13678218e-04 7.22678350e+01 -1.78992843e-04 7.01157927e-05 2.70506244e+01
1716.lowfreq: -9.2105 -7.9095 -0.0028 -0.0027 -0.0025 4.9522 142.4132 144.6314 203.3902
frequency: 142.4130 144.6311 203.3902 386.3448 386.9100 425.1088 430.3210 630.0501 685.6837 772.0229 790.4818 890.3690 949.7809 1140.1958 1164.0921 1168.9101 1210.5211 1366.0172 1426.9316 1435.0579 3191.2436
redmass: 14.7238 14.8448 23.0525 23.8102 10.2974 3.2433 18.1826 12.3747 10.0889 11.5847 9.4906 13.9933 1.4847 5.9132 8.8670 8.2796 12.3312 1.5912 12.2047 3.9793 1.0947
irintensity: 0.0000 0.0008 0.0023 1.6073 3.1237 2.8487 9.0329 0.0000 35.9789 144.5010 6.5045 4.1479 5.9553 135.6029 34.9613 8.4953 51.9173 317.2524 287.0740 368.2360 3.6764
temp: 298.150 k
press: 1.00000 atm
elementType: 17 17 7 7 7 6 6 6 1
symmnumber: 1
zpe: 113289.2 jmol-1
zpe.correction: 0.043150 hartree
zpe.thermalcorrener: 0.049688 hartree
zpe.thermalcorrenthalpy: 0.050632 hartree
zpe.thermalcorrgfe: 0.010932 hartree
zpe.sumelectzpe: -1198.687919 hartree
zpe.sumelectthermal: -1198.681381 hartree
zpe.sumelectthermalent: -1198.680437 hartree
zpe.sumelectthermalfe: -1198.720137 hartree
dipole: -0.0001 1.3624 0.0000
dipole: 1.3624
quadrupole: -64.5988 -57.9744 -57.6065
quadrupole: 0.0000 -0.0001 0.0001
quadrupole: -4.5389 2.0855 2.4534 0.0000 -0.0001 0.0001
hfenergy: -1198.7310689 hartree
pointgroup: C01 [X(C3H1Cl2N3)]
dipole: 0.0000735 -0.5360249 0.0001364 debye
dipolederiv: -0.725672 0.318886 -0.0000756 0.3861438 -0.2485169 0.0000506 -0.0000638 0.0000388 -0.035755 -0.7255424 -0.3189699 0.0000612 -0.3862288 -0.2486386 0.0000431 0.0000247 0.0000173 -0.0357501 -1.6273545 -0.0001107 -0.0000134 -0.0001115 -0.4260666 0.0001148 0.0000045 0.0000699 -0.0848937 -0.7924113 -0.1510083 0.0000556 -0.5249869 -0.9278864 0.0001931 0.0001142 0.0002336 -0.1059956 -0.7925305 0.1510357 -0.0000557 0.5250212 -0.9277812 0.000205 -0.0001298 0.0002238 -0.1059947 1.8319449 -0.4422694 0.0000891 -0.5249413 1.0430568 -0.0002323 0.0001003 -0.0002278 0.1024964 1.8317697 0.4424145 -0.0000601 0.5250781 1.0432182 -0.0002185 -0.0000597 -0.0002111 0.1024968 0.9186171 0.0000145 0.0000001 0.0000171 0.6971971 -0.0001836 0.0000073 -0.0002043 0.0534694 0.0811791 0.0000076 -0.0000013 0.0000082 -0.0045823 0.0000278 0.0000024 0.0000597 0.1099265 unknown
polarizability: 106.3934686|0.0029355|72.2678325|0.0006974|-0.0110132|27.050627 unknown
InChI: InChI=1S/C3HCl2N3/c4-2-6-1-7-3(5)8-2/h1H
charge 0 multiplicity 1
9 atoms
Cl -2.684982 1.177254 -0.000191
Cl 2.684773 1.177738 -0.000147
N  -0.000087 1.014091 -0.000213
N  1.215753 -1.081639 0.000362
N  -1.215545 -1.08186 0.00036
C  -1.136989 0.273532 -0.00002
C  1.13695 0.273745 -0.000048
C  0.000165 -1.70715 0.000496
H  0.000262 -2.800011 0.000901
