program: Gaussian 09
title: 000192376
version: EM64L-G09RevD.01
frameworkgroup: C1[X(C6H9O12P3)]
method: RPBEPBE
basis: SDD
operation: Freq
keyword: #p
keyword: freq=noraman
keyword: PBEPBE/SDD
title: #p freq=noraman PBEPBE/SDD
converged: YES YES NO NO
title: Mulliken charges:
elementType: P P P O O O O O O O O O O O O C C C C C C H H H H H H H H H
charge: 1.388379 1.441773 1.379750 -0.572864 -0.493155 -0.581474 -0.776601 -0.643628 -0.692463 -0.652574 -0.643276 -0.653730 -0.557286 -0.676395 -0.575998 0.300857 0.228828 0.449036 -0.484528 -0.296550 -0.346923 0.296650 0.271641 0.297053 0.432555 0.442577 0.479157 0.417515 0.405075 0.416597
chargesum: 0.00000
title: Mulliken charges with hydrogens summed into heavy atoms:
elementType: P P P O O O O O O O O O O O O C C C C C C
charge: 1.388379 1.441773 1.379750 -0.572864 -0.493155 -0.581474 -0.344046 -0.201051 -0.213306 -0.235060 -0.238201 -0.237133 -0.557286 -0.676395 -0.575998 0.300857 0.228828 0.449036 -0.187878 -0.024909 -0.049869
polarizability: 2.42070195e+02 1.96467956e+00 1.88174209e+02 1.09136518e+01 -2.11153074e+00 1.10734205e+02
1716.lowfreq: -4.0318 -0.0014 -0.0003 0.0005 2.4390 5.5424 21.2951 28.6350 47.5079
frequency: 21.1732 28.6258 47.4797 53.7980 72.8982 93.4102 107.3645 127.6256 133.1232 149.8227 163.6284 173.1631 177.5445 190.9294 212.5139 215.9857 228.1676 238.1539 249.9257 265.5526 274.1602 296.8406 306.4920 310.2558 323.8844 332.5875 351.0781 365.3904 371.0156 381.0456 389.6728 409.1885 422.0776 459.3556 467.5817 500.0749 547.7438 588.3659 613.8691 633.4629 647.3009 654.4040 695.3190 700.1061 739.5235 766.8618 794.5748 814.8708 821.3817 828.6849 831.4970 856.7735 877.3196 947.8316 957.2289 972.9000 978.2201 986.2005 1007.1553 1007.9838 1074.5691 1085.0867 1098.4968 1113.5756 1137.8998 1174.1080 1250.7770 1264.5002 1335.2823 1372.5512 1374.2105 1421.8323 1475.6889 1590.1155 1609.0490 2345.3726 2890.0860 3163.7341 3173.5292 3183.6764 3577.5859 3586.1818 3589.0867 3645.5916
redmass: 8.6703 7.9699 9.9082 10.2760 6.8203 11.1578 6.1786 3.1112 2.9591 6.1254 4.2135 4.5197 4.9196 4.6859 4.6364 2.3719 2.1633 2.3856 2.5424 3.6641 4.9426 7.4459 3.5134 3.6706 6.0443 3.1526 10.6609 7.0604 8.1250 7.7950 8.7567 8.4142 6.4396 4.3656 7.1826 9.6188 6.5811 9.7202 5.0580 10.4424 11.5682 8.9832 10.5958 3.8849 8.0849 9.9337 10.9614 10.2572 5.2122 2.0106 2.6860 1.3696 1.5293 3.2681 1.3555 3.0674 1.6862 1.1174 1.4033 1.3096 1.5283 4.1788 3.7708 3.2705 1.7891 1.6713 1.8214 3.1581 1.1263 1.4971 2.9485 3.9432 2.9768 8.4507 7.3351 1.0795 1.0733 1.0904 1.0940 1.0970 1.0659 1.0660 1.0665 1.0668
irintensity: 0.4441 2.1251 3.7683 1.0316 3.5796 4.9221 6.1527 103.5585 31.0019 36.8460 3.8197 4.2340 1.2676 22.3067 5.2578 41.9405 139.7786 32.1828 46.3983 11.0362 59.6127 16.5160 12.7192 33.5941 27.5829 31.9089 16.1928 48.9447 0.4432 73.6055 8.2312 58.7666 61.1511 30.0203 44.2218 3.3096 53.9146 23.3342 6.8165 16.0571 68.7959 98.8051 241.4272 15.9251 96.5087 270.1026 44.6950 222.7266 113.2986 165.5249 65.6921 354.0804 60.2955 237.9043 2.6675 218.1004 121.9252 331.8119 44.4943 22.1450 69.1003 126.2921 50.0811 222.3626 165.7191 71.4187 32.2988 36.4580 331.4178 126.5394 7.8317 22.1463 330.9987 14.0163 58.3870 1075.1054 1053.8813 1.1195 1.2069 0.8480 95.0754 126.0965 76.1908 132.8329
temp: 298.150 k
press: 1.00000 atm
elementType: 15 15 15 8 8 8 8 8 8 8 8 8 8 8 8 6 6 6 6 6 6 1 1 1 1 1 1 1 1 1
symmnumber: 1
zpe: 458850.1 jmol-1
zpe.correction: 0.174767 hartree
zpe.thermalcorrener: 0.198542 hartree
zpe.thermalcorrenthalpy: 0.199486 hartree
zpe.thermalcorrgfe: 0.121119 hartree
zpe.sumelectzpe: -2158.789345 hartree
zpe.sumelectthermal: -2158.765569 hartree
zpe.sumelectthermalent: -2158.764625 hartree
zpe.sumelectthermalfe: -2158.842992 hartree
dipole: -2.5756 0.6555 -3.4783
dipole: 4.3775
quadrupole: -127.3647 -148.2411 -148.5403
quadrupole: 3.3226 0.2714 0.5569
quadrupole: 14.0173 -6.8591 -7.1583 3.3226 0.2714 0.5569
hfenergy: -2158.9641113 hartree
pointgroup: C01[X(C6H9O12P3)]
dipole: -0.6862559 0.6438974 -1.4423999 debye
polarizability: 225.6124242|-24.1928851|201.8441401|9.0581635|-18.172225|113.5220446 unknown
InChI: InChI=1S/C6H9O12P3/c7-19(8,9)16-4-1-2-5(17-20(10,11)12)6(3-4)18-21(13,14)15/h1-3,7-8,10-11,13-14H
charge 0 multiplicity 1
30 atoms
P  -0.308203 3.063962 -0.175839
P  -3.344754 0.825391 0.140473
P  3.917275 -2.814771 0.349391
O  -0.672801 1.445181 -0.776863
O  -2.476007 -0.607012 -0.321951
O  3.007043 -1.384657 0.725054
O  -1.680632 3.651931 -1.101858
O  -0.790494 3.034422 1.419595
O  -3.602628 1.869044 -1.157356
O  -4.879212 0.132777 0.260254
O  4.182449 -2.554986 -1.33052
O  5.339943 -2.343131 1.149643
O  1.070633 3.740529 -0.52925
O  -2.780813 1.492673 1.482482
O  3.37379 -4.248067 0.734629
C  -0.152139 0.247042 -0.243494
C  -1.100427 -0.783247 -0.023233
C  1.621655 -1.23689 0.442384
C  1.21892 0.030197 -0.023829
C  -0.673358 -2.043641 0.430444
C  0.696235 -2.280924 0.671837
H  1.958114 0.813235 -0.216418
H  -1.419448 -2.825027 0.598165
H  1.034353 -3.255095 1.037635
H  -1.601081 4.563049 -1.473703
H  -1.646517 2.419348 1.591879
H  -2.884946 2.595631 -1.296697
H  -5.57231 0.611454 -0.26374
H  4.319523 -3.384741 -1.856196
H  5.435235 -1.365677 1.292584
