program: Gaussian 09
title: 000192371
version: EM64L-G09RevD.01
frameworkgroup: C1[X(C18H19NO2)]
method: RPBEPBE
basis: SDD
operation: Freq
keyword: #p
keyword: freq=noraman
keyword: PBEPBE/SDD
title: #p freq=noraman PBEPBE/SDD
converged: YES YES NO NO
title: Mulliken charges:
elementType: O O N C C C C C C C C C C C C C C C C C C H H H H H H H H H H H H H H H H H H H
charge: -0.461472 -0.504374 -0.093956 0.213587 0.039635 -0.724178 -0.489205 0.343120 0.220035 -0.554917 -0.751937 0.453240 0.051699 -0.682702 -0.416540 -0.396375 -0.486594 0.024299 -0.271591 0.129510 -0.380416 0.243390 0.244102 0.221334 0.227892 0.233549 0.218615 0.233282 0.216609 0.240501 0.206667 0.244625 0.221826 0.232258 0.295288 0.243216 0.223355 0.222870 0.393559 0.376194
chargesum: 0.00000
title: Mulliken charges with hydrogens summed into heavy atoms:
elementType: O O N C C C C C C C C C C C C C C C C C C
charge: -0.067914 -0.128180 -0.093956 0.213587 0.039635 -0.236686 -0.039979 0.343120 0.220035 -0.102753 -0.061545 0.453240 0.051699 -0.009583 -0.184282 -0.101087 -0.243378 0.024299 -0.048236 0.129510 -0.157546
polarizability: 2.84476758e+02 1.78808935e+01 2.25868371e+02 -2.46528693e+00 7.80061638e-01 1.18348362e+02
1716.lowfreq: -9.3070 -3.3773 0.0003 0.0005 0.0008 4.8751 50.2946 60.5177 84.6821
frequency: 50.0273 60.4841 84.6095 139.3687 158.3363 174.1615 179.8271 184.2326 213.7784 244.7477 247.4293 273.7009 291.1119 320.9311 328.5504 339.0448 349.2396 353.3346 368.5844 416.0397 426.9806 444.1589 468.5572 476.3585 485.6500 530.7231 542.6630 548.8744 555.2109 567.1015 579.4481 611.9137 612.8576 639.1127 706.7128 733.1314 746.7723 761.4037 773.1708 782.1299 806.1526 811.0330 846.7792 890.3025 907.2686 919.6181 932.5469 944.0482 978.4450 984.5175 990.2185 998.5911 1030.9510 1050.1103 1079.3566 1091.8515 1096.1454 1118.8841 1124.0445 1135.2995 1152.4689 1154.8254 1178.6199 1188.3070 1199.0103 1233.9168 1239.6488 1245.4888 1260.2419 1263.8082 1272.2938 1289.0450 1303.3970 1316.7531 1331.8611 1352.1826 1363.1968 1376.5544 1404.1323 1429.4395 1433.3848 1447.6890 1450.4590 1457.7897 1459.6218 1471.0654 1476.3664 1481.8030 1488.4978 1490.0238 1497.9475 1585.3895 1594.5539 1597.8620 1625.5294 2884.4972 2963.6490 2973.8863 2991.7861 3004.3486 3017.5734 3027.1775 3042.2001 3066.9312 3079.1789 3093.6431 3095.9583 3110.6711 3123.4594 3142.3580 3148.7983 3196.8767 3479.5323 3633.0072
redmass: 4.3091 3.7693 4.2154 2.5583 4.8186 3.7995 2.1951 1.6691 1.9918 1.1808 2.4569 1.6924 2.6698 3.3108 4.9910 5.8536 3.1621 4.1142 2.5710 3.2338 4.5680 3.1599 4.1995 3.5854 3.2805 1.1621 3.5884 4.9508 3.7174 3.4185 4.4219 3.6325 4.4209 3.5429 5.3034 5.7488 5.1112 1.8771 2.3960 1.8232 2.2067 3.6627 2.2324 2.1974 1.5657 1.4031 2.3280 1.7791 2.8017 1.4555 3.0356 2.2716 2.0753 2.5540 2.2834 2.1547 1.7560 1.5140 1.9556 1.4460 1.6861 1.8679 1.8582 1.3329 1.2934 2.0374 1.9396 2.3703 2.1742 2.3303 1.8346 1.9074 2.2172 2.2378 1.3649 1.4220 5.2520 1.2394 4.1868 2.4367 1.2036 1.7040 1.1311 1.3252 1.1265 1.0758 1.3536 1.8932 3.0473 1.1180 1.0583 6.5411 6.2980 7.8452 7.0016 1.0545 1.0621 1.0606 1.0359 1.0668 1.0925 1.0761 1.0993 1.1013 1.0996 1.0992 1.0993 1.0876 1.0879 1.0949 1.0964 1.0939 1.0643 1.0667
irintensity: 0.1628 2.5146 1.3093 2.0033 0.7252 1.2377 2.2517 2.5642 0.4527 159.0648 20.8453 1.6668 0.0822 0.2597 5.7110 1.7446 0.9802 0.5720 1.8288 3.2233 6.0712 1.4589 3.0099 3.4116 4.5146 100.6400 1.3023 13.3566 9.4984 11.5195 3.1091 10.1781 1.7409 6.7171 11.3405 1.3612 11.6338 18.1660 51.9583 42.9741 12.1586 10.9930 11.0134 16.7057 9.4241 1.4549 19.9878 4.5316 37.3960 5.2764 29.6099 10.2378 6.0621 18.2566 78.9954 65.6158 4.3971 20.4104 18.8404 23.4641 11.4785 25.4678 2.9921 1.6018 4.7296 10.3857 26.9982 31.0005 109.7690 119.2515 30.2423 7.2051 49.0229 5.2697 1.9783 4.0678 3.6310 18.9036 4.3618 5.7391 10.4228 37.5459 15.2763 14.3620 9.1306 26.9845 6.3577 44.4857 16.4220 16.3111 7.8705 13.0312 3.6117 2.3645 9.0290 79.2251 32.7123 22.1171 16.5112 54.5065 52.8504 57.4987 21.4242 35.7314 31.4444 27.4279 22.6433 12.0890 11.1255 37.1190 16.8582 5.7720 106.3961 66.6901
temp: 298.150 k
press: 1.00000 atm
elementType: 8 8 7 6 6 6 6 6 6 6 6 6 6 6 6 6 6 6 6 6 6 1 1 1 1 1 1 1 1 1 1 1 1 1 1 1 1 1 1 1
symmnumber: 1
zpe: 859489.0 jmol-1
zpe.correction: 0.327362 hartree
zpe.thermalcorrener: 0.345177 hartree
zpe.thermalcorrenthalpy: 0.346121 hartree
zpe.thermalcorrgfe: 0.283674 hartree
zpe.sumelectzpe: -900.999993 hartree
zpe.sumelectthermal: -900.982178 hartree
zpe.sumelectthermalent: -900.981234 hartree
zpe.sumelectthermalfe: -901.043681 hartree
dipole: -1.7433 -1.5366 -0.3838
dipole: 2.3553
quadrupole: -92.6525 -120.3916 -127.2116
quadrupole: 9.0353 -2.3298 1.7166
quadrupole: 20.7660 -6.9730 -13.7930 9.0353 -2.3298 1.7166
hfenergy: -901.3273549 hartree
pointgroup: C01 [X(C18H19N1O2)]
dipole: 0.7122566 -0.5761303 0.1395022 debye
polarizability: 285.74895|-15.404519|224.4980456|-4.8172935|-0.3796437|118.4464944 unknown
InChI: InChI=1S/C18H19NO2/c1-18-10-12-6-7-14(20)17(21)15(12)13-5-3-4-11(16(13)18)8-9-19(18)2/h3-7,20-21H,8-10H2,1-2H3
charge 0 multiplicity 1
40 atoms
O  2.857792 2.001204 -0.305166
O  4.951993 0.440654 -0.303407
N  -2.659049 -1.736304 -0.042698
C  -1.296977 -1.159418 -0.322755
C  -1.224351 0.363269 -0.043111
C  -0.2311 -1.84686 0.56726
C  -3.722093 -0.929658 -0.69954
C  -2.407823 1.148667 -0.005448
C  0.058422 0.982911 0.142013
C  -3.791669 0.518755 -0.155516
C  -0.952857 -1.434619 -1.817939
C  1.153854 -1.278916 0.320858
C  1.286521 0.136984 0.126516
C  -2.980886 -2.000479 1.380259
C  -2.312724 2.546539 0.211599
C  0.118901 2.386668 0.359287
C  2.277926 -2.126886 0.315995
C  2.60086 0.640888 -0.077263
C  -1.058685 3.160741 0.392104
C  3.722139 -0.232469 -0.077014
C  3.582092 -1.6123 0.121671
H  -0.244275 -2.936433 0.379409
H  -0.489869 -1.6880 1.632826
H  -4.69061 -1.443729 -0.555346
H  -3.529228 -0.911166 -1.785816
H  -4.29379 0.520846 0.833856
H  -4.419726 1.144512 -0.819466
H  -1.041199 -2.51794 -2.013549
H  -1.63011 -0.896665 -2.501879
H  0.074577 -1.108085 -2.050358
H  -2.873226 -1.121201 2.059988
H  -2.351908 -2.81559 1.77492
H  -4.030104 -2.343767 1.433931
H  -3.231277 3.146748 0.238634
H  1.08936 2.865385 0.494165
H  2.137618 -3.202799 0.464144
H  -0.993031 4.241933 0.557811
H  4.454948 -2.276236 0.117705
H  3.835708 2.102369 -0.464987
H  5.714456 -0.183556 -0.332994
