program: Gaussian 09
title: 000192366
version: EM64L-G09RevD.01
frameworkgroup: C1[X(C23H29NO4)]
method: RPBEPBE
basis: SDD
operation: Freq
keyword: #p
keyword: freq=noraman
keyword: PBEPBE/SDD
title: #p freq=noraman PBEPBE/SDD
converged: YES YES NO NO
title: Mulliken charges:
elementType: O O O O N C C C C C C C C C C C C C C C C C C C C C C C H H H H H H H H H H H H H H H H H H H H H H H H H H H H H
charge: -0.302960 -0.436209 -0.448134 -0.459864 -0.490941 0.387376 -0.351354 -0.513320 0.301746 -0.774925 -0.422587 -0.015818 -0.053718 0.132607 0.183524 -0.377220 0.176441 0.155539 -0.737720 -0.607567 0.025433 -0.821684 0.322686 -0.708021 0.135642 -0.460862 -0.368311 -0.502071 0.234991 0.222893 0.236949 0.254572 0.227067 0.224425 0.226329 0.182668 0.198468 0.205632 0.201633 0.307563 0.215852 0.214865 0.225274 0.295720 0.238558 0.272692 0.234466 0.221546 0.233322 0.183088 0.230001 0.357428 0.246593 0.214225 0.221262 0.361623 0.342588
chargesum: 0.00000
title: Mulliken charges with hydrogens summed into heavy atoms:
elementType: O O O O N C C C C C C C C C C C C C C C C C C C C C C C
charge: -0.302960 -0.078781 -0.086511 -0.117276 -0.183378 0.387376 -0.116363 -0.053478 0.301746 -0.068861 -0.013590 0.182649 -0.053718 0.132607 0.183524 0.030045 0.176441 0.155539 -0.081729 -0.311847 0.025433 -0.075968 0.322686 -0.070065 0.135642 -0.230861 -0.121718 -0.066583
polarizability: 3.38581603e+02 2.93445460e+00 3.50906123e+02 -5.06664126e+00 -1.05778033e+01 1.71074910e+02
1716.lowfreq: -6.9756 -4.0377 0.0005 0.0006 0.0007 6.7742 20.7542 31.1983 42.4625
frequency: 19.3731 31.0849 42.3026 46.1938 49.6526 73.2641 80.8558 83.6814 92.2422 94.4761 116.1619 123.5260 141.4975 150.9293 161.5772 179.1130 194.4103 202.0814 214.2568 220.7830 226.4987 239.9885 247.3128 264.9734 273.0850 285.3930 301.4479 315.4164 327.4049 344.6676 348.5717 357.7279 360.9995 370.4024 379.6777 390.6164 407.6543 419.5013 422.1936 440.2068 449.6846 462.1615 494.6507 509.2970 529.7657 566.1215 569.7340 574.5467 607.0949 640.9954 661.6585 668.7667 705.8984 713.6932 730.5524 738.0804 760.8140 768.4451 771.6353 789.6266 801.3791 805.3214 809.7503 870.9106 877.1941 906.3108 910.9984 912.1639 929.6921 954.0331 955.4570 956.9806 964.8079 993.8802 1008.7763 1021.8231 1029.8524 1037.5459 1044.2372 1054.9825 1058.6914 1068.0685 1076.1583 1108.9537 1113.9327 1123.9090 1151.7437 1159.8350 1169.8265 1174.5564 1195.5521 1198.4482 1231.3453 1243.0379 1252.6328 1253.7228 1256.9395 1262.8278 1288.1917 1293.5606 1293.9485 1296.4177 1321.2204 1332.7503 1334.4171 1341.2326 1348.0380 1359.6802 1368.2579 1380.5604 1384.5491 1386.1936 1386.8346 1398.7883 1401.5675 1411.4922 1434.0113 1447.9575 1454.6334 1458.9934 1465.1453 1469.3207 1470.7899 1470.9530 1475.2963 1476.3216 1479.1566 1480.2074 1486.1209 1491.5227 1508.7266 1512.1972 1593.5361 1598.2689 1618.7242 1625.3251 2946.1409 2952.7237 2964.8150 2972.2732 2973.5723 2976.4455 2986.9773 2987.9082 2989.6385 3012.1535 3013.6794 3017.8657 3046.2268 3046.7054 3051.9839 3055.2692 3069.4400 3071.1236 3071.9401 3072.5866 3106.8082 3128.4431 3133.5399 3138.9240 3170.1859 3541.5005 3563.9573 3580.9348 3581.9238
redmass: 4.9904 3.6108 3.4175 4.9149 4.4003 3.8873 2.6630 2.7115 4.9309 1.2452 5.0788 3.5295 2.7343 2.5104 2.5569 1.3712 5.3422 1.8965 3.5052 1.3953 2.4754 1.3936 3.8011 1.6644 2.7837 2.0024 2.0847 2.9923 2.1712 2.2408 2.1299 1.9090 3.4499 1.6853 3.2483 4.4131 3.1269 1.8299 2.8005 2.5459 3.6613 3.8221 5.5138 4.3868 2.8265 4.2822 4.4701 4.4311 5.0286 4.5877 5.3746 6.4360 5.0558 4.5547 2.6624 3.5442 2.6051 2.3738 2.2920 4.1939 5.8626 1.4031 1.4801 1.5630 4.4871 2.7526 1.9733 2.1947 1.9246 1.7540 2.3342 1.4550 1.8723 1.8379 2.2538 2.5623 1.7683 1.9871 1.5434 1.5599 1.8819 1.8098 1.8760 1.9314 1.7021 1.7612 1.3673 1.9768 1.4693 2.0326 2.2018 1.6019 1.8153 1.4839 1.7082 1.6207 1.2825 3.6007 1.2510 1.3744 1.7796 1.3266 1.9773 2.3291 1.5100 3.4994 1.5820 1.3776 1.3973 2.8947 1.2393 1.3937 2.4118 1.2646 1.2301 3.0963 6.4274 4.2721 1.0786 1.2076 1.0744 1.0770 1.0877 1.0956 1.0535 1.1288 1.0585 1.0788 1.0570 1.0597 3.4584 3.9685 7.7956 7.4049 7.3291 8.5244 1.0724 1.0444 1.0649 1.0640 1.0460 1.0518 1.0379 1.0403 1.0586 1.0945 1.0861 1.0988 1.0991 1.1009 1.1011 1.0955 1.0994 1.0991 1.0980 1.0983 1.0986 1.0891 1.0928 1.0973 1.0944 1.0664 1.0662 1.0676 1.0777
irintensity: 0.3794 0.6824 0.4112 0.2088 0.0295 0.2710 0.7706 0.5888 1.6533 0.2776 1.1743 3.3513 0.9456 1.2959 1.0707 0.3459 3.3505 1.1423 7.2975 1.0377 48.3614 7.9881 3.9660 48.3697 29.2450 4.6559 30.9154 24.2623 52.1609 112.1530 13.4542 54.5682 6.8211 89.3898 2.3947 13.7698 34.0398 44.6527 11.2030 6.0168 12.3750 0.9508 14.7164 14.4536 17.5114 12.9871 6.4137 5.2311 5.4553 1.7915 2.1502 5.0636 1.2387 13.7881 2.4216 15.6112 3.9960 1.8001 10.4744 18.2849 24.1269 2.6866 43.8812 20.9201 9.0309 2.5565 22.9937 16.5482 32.6809 6.5296 7.2221 7.6296 4.7268 2.7464 21.8065 9.0592 10.3566 3.4811 4.6846 62.2394 26.5766 45.5473 57.2420 47.6124 214.1626 34.5352 10.8924 35.1551 10.8337 37.1412 28.1455 2.4997 125.8152 23.0135 26.3739 3.0737 2.1789 2.2751 11.1859 6.0195 7.0575 2.4767 37.9608 37.6869 2.8229 9.5789 0.9479 2.2113 61.2746 3.3028 11.3335 16.5271 8.0042 24.5679 29.5986 41.7540 63.0019 76.3164 0.6861 5.0257 1.9154 6.6603 10.1059 6.4695 14.2763 13.7528 13.5754 18.4646 11.5902 2.7847 10.1444 23.5643 42.1229 12.0419 34.8989 0.6754 18.9946 34.2104 118.7095 77.7683 13.1080 35.4587 18.2584 23.6950 43.3968 26.7619 27.4013 3.7256 16.8912 68.5331 73.8372 15.3273 24.7392 62.8828 51.9116 29.8243 16.1437 18.0136 9.4649 2.3754 7.9622 55.0483 4.8438 86.7383 89.4579
temp: 298.150 k
press: 1.00000 atm
elementType: 8 8 8 8 7 6 6 6 6 6 6 6 6 6 6 6 6 6 6 6 6 6 6 6 6 6 6 6 1 1 1 1 1 1 1 1 1 1 1 1 1 1 1 1 1 1 1 1 1 1 1 1 1 1 1 1 1
symmnumber: 1
zpe: 1233776.3 jmol-1
zpe.correction: 0.469921 hartree
zpe.thermalcorrener: 0.499222 hartree
zpe.thermalcorrenthalpy: 0.500166 hartree
zpe.thermalcorrgfe: 0.410390 hartree
zpe.sumelectzpe: -1247.384401 hartree
zpe.sumelectthermal: -1247.355100 hartree
zpe.sumelectthermalent: -1247.354156 hartree
zpe.sumelectthermalfe: -1247.443932 hartree
dipole: 2.3903 -2.8334 -0.2204
dipole: 3.7135
quadrupole: -151.7552 -182.8403 -164.8929
quadrupole: -1.4441 -0.4833 6.2057
quadrupole: 14.7409 -16.3442 1.6032 -1.4441 -0.4833 6.2057
hfenergy: -1247.854322 hartree
pointgroup: C01 [X(C23H29N1O4)]
dipole: 0.8360815 -1.1723533 -0.2472373 debye
polarizability: 339.0060753|3.1080477|347.1365534|9.4729554|25.3134283|174.4200077 unknown
InChI: InChI=1S/C23H29NO4/c1-5-12(2)8-9-23(4)22(28-23)18-13(3)17(27)10-15-19-14(11-25)6-7-16(26)21(19)24-20(15)18/h6-7,10,12,22,24-27H,5,8-9,11H2,1-4H3
charge 0 multiplicity 1
57 atoms
O  2.506887 2.89004 0.517325
O  -2.804115 4.199889 0.226268
O  0.288206 -3.582631 -0.86016
O  -5.230193 0.073457 -1.075146
N  0.009464 -0.567336 -0.409103
C  2.523004 1.441912 0.989748
C  1.622015 1.879635 -0.156366
C  3.825399 0.713955 0.663522
C  0.123284 1.947283 -0.05504
C  1.941934 1.256926 2.381706
C  3.749516 -0.815416 0.915213
C  4.908262 -1.647467 0.295222
C  -0.555673 0.70971 -0.202299
C  -0.661073 3.119772 0.096529
C  -1.979165 0.583435 -0.188466
C  4.888109 -1.682386 -1.259021
C  -2.091172 2.984436 0.096627
C  -2.289342 -0.835986 -0.352882
C  6.289458 -1.173523 0.809533
C  -2.760339 1.755973 -0.047118
C  -1.02853 -1.508909 -0.496191
C  -0.080943 4.515642 0.211956
C  -3.494284 -1.599366 -0.348236
C  3.60067 -2.274142 -1.878802
C  -0.94571 -2.904231 -0.711098
C  -3.387633 -2.999299 -0.522848
C  -2.138167 -3.648221 -0.712317
C  -4.849015 -0.97095 -0.09393
H  1.990722 1.62722 -1.166495
H  4.089799 0.922096 -0.390579
H  4.634046 1.149105 1.281958
H  1.063869 1.906725 2.524891
H  1.62676 0.21084 2.550907
H  2.697231 1.514081 3.146752
H  3.728079 -1.001247 2.007043
H  2.787765 -1.215693 0.53058
H  4.759347 -2.693842 0.640885
H  5.752384 -2.290166 -1.593997
H  5.059974 -0.66389 -1.662146
H  0.994202 -0.783208 -0.265818
H  6.318432 -1.144462 1.914824
H  7.090853 -1.85407 0.467225
H  6.53129 -0.160809 0.437462
H  -3.853193 1.698005 -0.109178
H  -0.483412 5.026137 1.105787
H  1.015067 4.499016 0.273417
H  -0.394117 5.131136 -0.652362
H  3.362851 -3.255522 -1.423365
H  3.718898 -2.42545 -2.966819
H  2.734761 -1.59495 -1.741199
H  -4.299794 -3.607823 -0.515053
H  -3.777673 4.025898 0.20396
H  -2.08032 -4.729925 -0.865288
H  -5.628025 -1.759384 -0.058689
H  -4.863553 -0.429122 0.868891
H  0.950597 -3.024054 -1.341454
H  -5.064691 -0.276346 -1.986967
