program: Gaussian 09
title: 000192352
version: EM64L-G09RevD.01
frameworkgroup: C1[X(C17H18ClN3O3)]
method: RPBEPBE
basis: SDD
operation: Freq
keyword: #p
keyword: freq=noraman
keyword: PBEPBE/SDD
title: #p freq=noraman PBEPBE/SDD
converged: YES YES NO NO
title: Mulliken charges:
elementType: Cl O O O N N N C C C C C C C C C C C C C C C C C H H H H H H H H H H H H H H H H H H
charge: -0.032242 -0.260673 -0.279009 -0.299523 -0.272497 -0.113689 -0.023101 0.361877 -0.574133 0.345821 0.330969 -0.195469 0.133825 0.155949 -0.263043 0.228489 -0.342170 -0.713687 -0.696041 -0.712682 -0.625191 -0.299329 -0.220003 -0.135695 0.301287 0.266039 0.277112 0.261435 0.225725 0.213065 0.263022 0.232379 0.234026 0.199810 0.263958 0.212712 0.224700 0.233833 0.247402 0.276750 0.302601 0.265392
chargesum: 0.00000
title: Mulliken charges with hydrogens summed into heavy atoms:
elementType: Cl O O O N N N C C C C C C C C C C C C C C C C C
charge: -0.032242 -0.260673 -0.279009 -0.299523 -0.272497 -0.113689 -0.023101 0.361877 -0.006807 0.345821 0.330969 -0.195469 0.133825 0.155949 0.014069 0.228489 -0.080735 -0.011876 -0.029825 -0.011313 0.132794 0.003272 0.045389 -0.135695
polarizability: 3.64343078e+02 -8.25816338e+00 2.13533079e+02 2.01635614e+00 5.60401269e+00 1.32946091e+02
1716.lowfreq: -5.2015 -0.0014 -0.0012 -0.0007 2.1775 5.8630 23.2075 25.1730 44.7943
frequency: 23.1842 25.1166 44.7897 62.8663 77.1975 87.2235 98.2244 113.2801 121.2661 144.5794 150.7698 170.7263 176.7644 194.3345 217.5663 234.4666 236.3993 248.3648 262.8539 278.9995 309.2730 327.6299 335.5985 343.3666 369.3808 382.5386 390.1444 402.3813 412.2568 439.4563 449.0761 459.0773 504.8791 511.7172 555.6950 579.9100 632.5997 651.0124 654.2549 678.1718 698.3791 713.5424 733.5629 755.6981 769.1985 781.0616 788.5898 800.3498 820.4983 826.0556 905.6518 912.7261 917.0992 920.2240 924.6278 955.1886 956.1354 967.8746 1029.6293 1033.3503 1036.4766 1064.2137 1089.0296 1098.5521 1122.0005 1135.9306 1154.9382 1181.1005 1183.1664 1213.6338 1242.4967 1246.2083 1256.2438 1267.3405 1271.7807 1280.3279 1324.5341 1342.4557 1366.5953 1373.7746 1374.5675 1378.1817 1388.9646 1400.5812 1405.2896 1421.1340 1444.5405 1446.5402 1467.0569 1467.2769 1467.9751 1469.5643 1473.8988 1477.8383 1479.1269 1488.8665 1501.8268 1548.7955 1562.2808 1577.7030 1582.3597 1604.3545 2983.3976 2985.6769 2990.4968 2992.2015 2997.2359 3066.8332 3082.3180 3085.3275 3098.0704 3103.1720 3103.6862 3115.3785 3119.2754 3125.5276 3153.7498 3176.5335 3179.4606 3239.6979
redmass: 5.7411 3.5011 6.2017 5.7583 5.4831 3.9552 5.2294 2.7897 1.2661 6.0550 4.8162 5.7273 1.0863 5.5280 4.8478 1.1263 3.8391 1.1020 5.0867 3.8250 3.4833 4.5770 2.6905 5.4361 5.0689 4.0820 5.2735 3.5413 2.9752 3.0276 2.9021 5.1883 5.7153 4.8164 4.7816 4.5185 8.8193 4.9387 5.5537 5.5590 6.6049 6.4524 7.9734 5.1868 3.6969 4.5822 2.6529 3.0951 4.0447 1.4529 2.9102 1.8515 1.5882 2.0155 2.4928 1.2025 1.3507 2.9053 1.4250 1.5684 3.5307 2.1875 2.0196 3.2894 1.3136 2.8322 1.7663 3.1598 2.4729 2.3389 1.7548 3.0491 3.0156 2.8662 1.4763 2.7921 1.4824 6.1572 6.1891 1.2273 3.0142 1.3306 3.7805 1.2242 2.7745 1.3585 1.0467 3.6936 1.0594 1.1151 1.0793 1.1023 2.7026 1.1586 1.0528 1.1164 1.0638 8.5076 6.8809 8.1839 8.2025 7.1833 1.0412 1.0618 1.0362 1.0359 1.0363 1.1016 1.0992 1.0990 1.0993 1.1004 1.0953 1.1001 1.0993 1.0992 1.0894 1.0926 1.0969 1.0987
irintensity: 0.2802 0.1552 0.0745 5.2615 3.2774 0.6821 1.2337 0.2467 0.2062 0.6921 4.8766 0.2806 0.0426 2.7587 3.3101 0.4534 3.4319 0.2255 1.1092 1.3756 15.2609 2.1384 2.0751 1.3849 12.1598 1.3872 16.6218 1.4005 5.9060 1.9325 0.3053 4.6163 8.0968 11.7230 31.6281 6.0141 3.7921 15.1757 4.2232 10.5263 16.9636 5.5474 8.2115 7.3444 9.1494 4.3868 24.1241 11.2380 3.6985 35.5784 7.1881 46.4857 0.6382 29.9135 57.4562 0.1691 0.4911 17.8801 0.0211 9.9666 109.6787 6.4485 27.7651 303.9548 3.4847 335.1654 22.3898 109.7398 26.4498 106.4892 97.2837 19.9280 27.2837 42.0997 19.3055 46.8393 15.1159 135.3583 29.1493 41.5723 29.9973 51.4845 4.9180 38.8589 6.6337 67.0327 0.6896 125.0694 3.9182 58.4270 4.0566 26.4552 175.9379 16.2634 4.5930 3.8676 27.6231 102.2921 139.3620 72.7242 228.8137 7.0150 37.6390 23.3937 23.2898 9.5899 38.3901 21.9909 10.3428 22.0442 62.0667 24.7342 7.0305 4.4181 20.5659 1.2075 3.6489 2.4802 2.9449 0.4926
temp: 298.150 k
press: 1.00000 atm
elementType: 17 8 8 8 7 7 7 6 6 6 6 6 6 6 6 6 6 6 6 6 6 6 6 6 1 1 1 1 1 1 1 1 1 1 1 1 1 1 1 1 1 1
symmnumber: 1
zpe: 848417.9 jmol-1
zpe.correction: 0.323145 hartree
zpe.thermalcorrener: 0.346172 hartree
zpe.thermalcorrenthalpy: 0.347117 hartree
zpe.thermalcorrgfe: 0.270071 hartree
zpe.sumelectzpe: -1506.873473 hartree
zpe.sumelectthermal: -1506.850446 hartree
zpe.sumelectthermalent: -1506.849502 hartree
zpe.sumelectthermalfe: -1506.926547 hartree
dipole: -1.9618 -1.7178 2.0913
dipole: 3.3426
quadrupole: -145.8029 -144.4491 -150.6395
quadrupole: -14.7891 4.3684 2.6163
quadrupole: 1.1610 2.5147 -3.6757 -14.7891 4.3684 2.6163
hfenergy: -1507.1966183 hartree
pointgroup: C01 [X(C17H18Cl1N3O3)]
dipole: 0.7879358 0.6489591 0.8291172 debye
polarizability: 363.9392826|-11.2136257|214.0569326|-3.0976966|-4.3956879|132.8260332 unknown
InChI: InChI=1S/C17H18ClN3O3/c1-17(2,3)24-16(23)14-13-8-20(4)15(22)11-7-10(18)5-6-12(11)21(13)9-19-14/h5-7,9H,8H2,1-4H3
charge 0 multiplicity 1
42 atoms
Cl -6.747924 0.701298 0.417268
O  3.83496 0.692148 -0.171207
O  -2.87443 -2.601881 -1.133601
O  2.86094 -1.164785 0.891949
N  -0.726937 0.939649 -0.20093
N  -0.965045 -2.100421 0.103858
N  1.310096 1.771845 -0.770965
C  0.219708 0.039989 0.306607
C  -0.234793 -1.192851 1.0244
C  -2.146458 0.830147 -0.038105
C  5.280544 0.232416 0.043897
C  1.472054 0.567691 -0.050561
C  -2.819205 -0.428211 -0.089761
C  -2.208762 -1.784481 -0.418336
C  -0.010631 1.968469 -0.844675
C  2.77155 -0.060682 0.275216
C  -2.883322 2.026185 0.158074
C  5.501106 -1.108663 -0.683736
C  6.069449 1.373654 -0.618858
C  5.565478 0.145765 1.55641
C  -0.31747 -3.375059 -0.262317
C  -4.233088 -0.44053 0.040494
C  -4.28228 1.999387 0.297211
C  -4.939748 0.753599 0.238239
H  0.655026 -1.716436 1.403955
H  -0.883117 -0.930613 1.883648
H  -0.500412 2.783898 -1.370647
H  -2.352799 2.980983 0.225341
H  5.211709 -1.023012 -1.746054
H  6.573611 -1.373114 -0.640092
H  4.91859 -1.916902 -0.215017
H  5.852544 2.334556 -0.122163
H  5.795036 1.466152 -1.683371
H  7.153325 1.172095 -0.546698
H  4.981724 -0.661253 2.025577
H  6.641104 -0.056477 1.7121
H  5.320907 1.102865 2.050077
H  -0.225106 -4.033541 0.621283
H  0.690954 -3.183978 -0.670782
H  -0.942368 -3.873827 -1.018121
H  -4.748844 -1.39985 -0.05499
H  -4.845774 2.922672 0.456181
