program: Gaussian 09
title: 000192342
version: EM64L-G09RevD.01
frameworkgroup: C1[X(C13H11NOS2)]
method: RPBEPBE
basis: SDD
operation: Freq
keyword: #p
keyword: freq=noraman
keyword: PBEPBE/SDD
title: #p freq=noraman PBEPBE/SDD
converged: YES YES NO NO
title: Mulliken charges:
elementType: S S O N C C C C C C C C C C C C C H H H H H H H H H H H
charge: 0.741886 0.325173 -0.573622 -0.481500 -0.592280 -0.115923 -0.147928 0.434040 -0.233707 -0.242605 -0.355643 -0.360650 -0.224392 -0.209319 -0.230478 -0.236550 -0.236829 0.287602 0.263410 0.267435 0.251074 0.283648 0.234526 0.239391 0.235435 0.226113 0.225282 0.226412
chargesum: 0.00000
title: Mulliken charges with hydrogens summed into heavy atoms:
elementType: S S O N C C C C C C C C C C C C C
charge: 0.741886 0.325173 -0.573622 -0.481500 -0.041268 -0.115923 -0.147928 0.434040 0.033728 0.008469 -0.071995 -0.126125 0.014999 0.026116 -0.004365 -0.011267 -0.010417
polarizability: 1.53215529e+02 6.40254433e+00 1.95453575e+02 2.63008151e+01 -7.60541096e+00 1.68871550e+02
1716.lowfreq: -16.9517 -7.9178 -6.7154 -0.0022 -0.0008 0.0011 25.1859 36.3568 68.5232
frequency: 23.9042 36.0079 68.4113 82.1887 113.5990 154.5769 163.7467 200.6934 228.6602 282.4486 293.5395 329.5057 343.3799 375.6441 387.0306 406.5870 427.8244 441.7696 471.2081 488.1304 520.1649 558.9471 615.9890 626.4637 639.6711 681.2745 703.5784 706.9085 749.6540 756.2066 819.1099 835.5816 859.8976 862.8223 886.4803 924.8799 940.6045 942.1163 983.1602 985.0196 987.7244 989.8124 1007.3468 1018.0557 1027.1999 1081.2637 1085.1460 1117.9667 1171.9871 1173.4160 1191.0138 1209.5648 1222.1570 1254.4845 1312.8783 1332.5195 1378.2866 1384.0901 1419.0481 1427.1625 1428.8037 1440.9122 1481.8641 1564.4363 1587.1166 1590.5252 1611.7090 2974.2937 3042.5744 3117.8280 3120.9444 3132.1453 3137.1894 3144.4049 3145.2814 3157.6723 3160.8109 3172.3986
redmass: 5.3175 4.8756 4.3293 6.5785 4.8271 8.5052 6.5079 6.5934 6.9298 8.3627 5.1235 5.8104 2.9338 6.8958 8.3638 2.8654 3.8104 5.7145 6.2841 5.5339 4.6824 6.8757 6.3032 4.7725 6.7432 6.8742 4.7942 1.9029 1.9342 1.2786 3.3272 15.1345 1.3028 1.2927 4.8991 2.1036 1.4974 1.3967 5.0913 1.4075 1.4665 5.2560 1.3270 3.1377 2.2287 2.3819 1.6377 1.5537 1.0546 1.0666 1.1267 2.2396 1.2797 1.4047 1.1969 1.2481 7.9502 7.7815 2.1715 2.1175 1.1243 2.1652 2.2436 6.2073 7.0533 6.0262 5.9514 1.0617 1.0996 1.0855 1.0884 1.0921 1.0856 1.0962 1.0901 1.0949 1.1015 1.1008
irintensity: 0.4318 0.3721 0.0910 1.2564 0.9644 3.2011 5.2059 0.5164 0.8209 1.7972 8.0239 2.3346 3.8909 6.4276 8.0596 0.0482 4.5777 1.4925 28.5211 7.4920 12.1009 4.5162 0.2336 18.9734 0.5104 5.2261 5.3391 52.6298 79.7930 44.4425 9.7506 46.4222 0.0772 0.9985 7.2764 0.2744 4.2799 0.3895 1.9561 0.9878 0.0808 0.0889 2.4341 3.1678 4.0049 1.3958 11.3573 2.7743 0.0281 0.3836 2.0711 12.9960 1.4943 6.7169 5.9114 0.8184 3.6226 0.1910 6.5058 17.2464 35.0741 9.7063 9.4705 6.1490 4.3468 0.9824 0.3356 7.6876 4.2693 0.5900 3.1179 7.1184 1.2182 29.2618 1.3834 7.3185 26.1864 21.4764
temp: 298.150 k
press: 1.00000 atm
elementType: 16 16 8 7 6 6 6 6 6 6 6 6 6 6 6 6 6 1 1 1 1 1 1 1 1 1 1 1
symmnumber: 1
zpe: 536641.3 jmol-1
zpe.correction: 0.204396 hartree
zpe.thermalcorrener: 0.219547 hartree
zpe.thermalcorrenthalpy: 0.220491 hartree
zpe.thermalcorrgfe: 0.160911 hartree
zpe.sumelectzpe: -1426.766193 hartree
zpe.sumelectthermal: -1426.751042 hartree
zpe.sumelectthermalent: -1426.750097 hartree
zpe.sumelectthermalfe: -1426.809678 hartree
dipole: 0.8108 3.9716 1.3490
dipole: 4.2721
quadrupole: -111.1107 -105.9065 -114.7917
quadrupole: -3.6855 4.2411 -4.4005
quadrupole: -0.5077 4.6965 -4.1888 -3.6855 4.2411 -4.4005
hfenergy: -1426.9705888 hartree
pointgroup: C01 [X(C13H11N1O1S2)]
dipole: -0.3495531 1.5118559 -0.6458603 debye
polarizability: 148.4935213|8.3113846|187.5412356|25.5488691|-9.103705|181.5058974 unknown
InChI: InChI=1S/C13H11NOS2/c15-17-13-9-5-4-8-12(13)16-14(17)10-11-6-2-1-3-7-11/h1-9H,10H2
charge 0 multiplicity 1
28 atoms
S  -1.382574 -2.21213 1.149019
S  -0.625021 0.386785 2.556912
O  -0.566703 -3.172675 0.076849
N  -0.003957 -1.347093 2.308709
C  1.36252 -1.480613 1.649304
C  -1.755489 -0.588418 0.220712
C  -1.405397 0.593345 0.89562
C  1.785915 -0.483298 0.586314
C  -2.348915 -0.58358 -1.049532
C  -1.675688 1.840451 0.295839
C  1.514612 -0.724917 -0.785949
C  2.49249 0.692027 0.951554
C  -2.623557 0.668487 -1.653711
C  -2.294573 1.86717 -0.977951
C  1.935231 0.196454 -1.770054
C  2.909937 1.616418 -0.031847
C  2.631774 1.370085 -1.396662
H  1.356372 -2.50961 1.233679
H  2.058857 -1.469215 2.508677
H  -2.580338 -1.523762 -1.561338
H  -1.388293 2.772066 0.793432
H  0.970826 -1.635119 -1.06772
H  2.716485 0.880313 2.008654
H  -3.085773 0.704188 -2.645405
H  -2.498932 2.833471 -1.45151
H  1.723119 -0.002072 -2.826764
H  3.457553 2.51884 0.262969
H  2.961119 2.082402 -2.161901
