program: Gaussian 09
title: 000192316
version: EM64L-G09RevD.01
frameworkgroup: C1[X(C12H12N2O2)]
method: RPBEPBE
basis: SDD
operation: Freq
keyword: #p
keyword: freq=noraman
keyword: PBEPBE/SDD
title: #p freq=noraman PBEPBE/SDD
converged: YES YES NO NO
title: Mulliken charges:
elementType: O O N N C C C C C C C C C C C C H H H H H H H H H H H H
charge: -0.279795 -0.286684 -0.238216 -0.007879 -0.455557 -0.355911 -0.502993 0.109043 0.170206 0.031509 0.076792 0.247252 -0.390574 -0.377523 -0.188628 -0.527252 0.238062 0.239870 0.252008 0.258740 0.250090 0.260247 0.265246 0.257777 0.233766 0.286828 0.229627 0.203948
chargesum: 0.00000
title: Mulliken charges with hydrogens summed into heavy atoms:
elementType: O O N N C C C C C C C C C C C C
charge: -0.279795 -0.286684 -0.238216 -0.007879 0.022375 0.154837 0.007344 0.109043 0.170206 0.031509 0.076792 0.247252 -0.125328 -0.119746 0.045138 0.193151
polarizability: 2.08273322e+02 -7.09035155e+00 1.72078275e+02 4.54458934e-01 2.52258241e+00 7.76392952e+01
1716.lowfreq: -11.2303 0.0006 0.0008 0.0008 4.3227 7.1292 41.2249 80.3908 94.8647
frequency: 41.1509 80.3802 94.8639 130.8338 143.7583 161.3205 200.8298 225.3439 251.7975 280.6131 309.1452 328.0432 372.3808 416.3413 471.5613 495.8045 522.3445 567.9380 571.7057 601.8141 640.9118 663.8059 685.0252 710.1291 764.7029 776.8514 829.2306 834.9274 876.9716 884.4525 908.2574 911.9314 934.7537 986.8887 1022.6035 1037.1106 1055.9304 1066.4857 1074.2621 1108.0950 1150.3983 1154.3603 1164.7354 1175.6247 1201.6250 1209.1341 1228.1522 1248.3665 1266.9835 1270.4578 1295.2978 1318.2425 1348.4385 1366.7730 1408.9344 1416.2419 1447.4984 1456.5228 1457.8859 1477.4520 1493.3577 1496.2279 1554.0632 1572.1232 1599.3939 1622.0252 2973.8157 3008.4172 3011.3746 3026.6629 3085.5943 3087.7441 3088.8949 3104.7179 3123.1968 3141.7863 3170.2944 3180.5561
redmass: 3.2754 3.4924 2.1765 3.1807 1.8219 1.9406 5.7067 3.0203 3.3511 4.5473 5.3467 6.1444 5.5061 6.2146 5.5396 4.0431 6.4397 3.6431 6.2749 6.5021 2.5761 4.5350 4.0288 6.3241 4.8223 2.1960 2.4599 2.3379 2.5265 1.9664 1.7690 3.5720 2.5277 1.3348 3.0554 2.6062 7.0113 2.0301 1.6901 1.2373 1.5687 1.4381 1.3168 1.7095 1.4082 1.3589 2.4455 3.6075 2.6560 2.4851 1.6253 1.4699 5.5433 2.5890 2.1603 1.7827 1.1849 1.1264 1.7637 1.0926 1.0995 1.0637 6.3777 10.2296 7.5645 10.4113 1.0330 1.0663 1.0653 1.0641 1.0972 1.0993 1.0985 1.1041 1.1046 1.0878 1.0923 1.0985
irintensity: 1.7315 2.8130 4.5431 3.7473 0.7794 3.7415 1.2695 1.9569 3.0693 4.0441 5.0621 3.0544 7.5211 6.5652 1.0847 4.5286 2.9540 5.4775 0.9301 3.3483 5.7416 3.2612 18.0287 12.2120 2.9873 17.8735 35.4678 22.8413 6.1750 1.7243 4.1250 7.1791 3.7454 1.7356 23.3244 62.5142 4.7760 9.8958 0.5569 20.3761 3.3276 11.1282 0.7345 13.0680 6.0942 7.6531 43.8528 77.8934 43.0963 24.2967 2.1847 0.6555 6.4856 24.3002 13.0127 33.7346 32.7896 41.6042 56.9923 9.2606 3.0760 46.9179 67.9784 267.2043 235.0787 182.6955 91.6261 11.5211 22.7415 32.2858 14.1617 31.1079 4.8166 33.1788 9.2163 12.2036 5.3472 10.5358
temp: 298.150 k
press: 1.00000 atm
elementType: 8 8 7 7 6 6 6 6 6 6 6 6 6 6 6 6 1 1 1 1 1 1 1 1 1 1 1 1
symmnumber: 1
zpe: 576867.2 jmol-1
zpe.correction: 0.219717 hartree
zpe.thermalcorrener: 0.233063 hartree
zpe.thermalcorrenthalpy: 0.234008 hartree
zpe.thermalcorrgfe: 0.179583 hartree
zpe.sumelectzpe: -723.290753 hartree
zpe.sumelectthermal: -723.277407 hartree
zpe.sumelectthermalent: -723.276463 hartree
zpe.sumelectthermalfe: -723.330887 hartree
dipole: 3.0385 0.4469 1.7087
dipole: 3.5145
quadrupole: -73.9676 -95.7190 -93.9430
quadrupole: -5.3865 -4.0720 -5.4561
quadrupole: 13.9089 -7.8424 -6.0665 -5.3865 -4.0720 -5.4561
hfenergy: -723.5104701 hartree
pointgroup: C01 [X(C12H12N2O2)]
dipole: -1.1900845 -0.2096645 0.6720246 debye
polarizability: 208.2486781|-7.0465631|172.0922617|-1.8707856|2.3637289|77.6499531 unknown
InChI: InChI=1S/C12H12N2O2/c1-16-9-5-2-4-8-11(9)12(15)14-7-3-6-10(14)13-8/h2,4-5H,3,6-7H2,1H3
charge 0 multiplicity 1
28 atoms
O  -0.092798 2.282861 -0.345247
O  2.798417 1.515427 -0.143466
N  -1.57967 0.535349 -0.034849
N  -1.004234 -1.786522 0.108765
C  -3.912341 0.475257 0.409944
C  -2.780837 1.404042 -0.115388
C  -3.404456 -0.970698 0.134698
C  -1.896784 -0.819119 0.086227
C  -0.257415 1.03782 -0.146576
C  0.779804 -0.013712 -0.038846
C  0.354018 -1.40165 0.018387
C  2.194183 0.253908 -0.095379
C  1.303555 -2.453763 -0.033382
C  3.111614 -0.818023 -0.17409
C  2.671138 -2.160072 -0.152338
C  2.509177 2.514717 0.908718
H  -4.873869 0.686883 -0.084349
H  -4.046615 0.627541 1.494998
H  -2.937709 1.720381 -1.163237
H  -2.626735 2.31224 0.488293
H  -3.762158 -1.354901 -0.839426
H  -3.705088 -1.699649 0.903698
H  0.927867 -3.479214 0.012423
H  4.174254 -0.566042 -0.234748
H  3.405356 -2.970969 -0.206013
H  1.529411 2.983478 0.728788
H  3.320756 3.252829 0.81582
H  2.546459 2.039401 1.907974
