program: Gaussian 09
title: 000192303
version: EM64L-G09RevD.01
frameworkgroup: C1[X(C10H5NO3)]
method: RPBEPBE
basis: SDD
operation: Freq
keyword: #p
keyword: freq=noraman
keyword: PBEPBE/SDD
title: #p freq=noraman PBEPBE/SDD
converged: NO NO NO NO
title: Mulliken charges:
elementType: O O O N C C C C C C C C C C H H H H H
charge: -0.197808 -0.206116 -0.177018 0.103349 0.276370 0.344025 -0.432072 -0.047927 -0.037469 -0.375765 -0.244333 -0.139786 -0.303348 0.122939 0.267428 0.270604 0.245099 0.272657 0.259174
chargesum: 0.00000
title: Mulliken charges with hydrogens summed into heavy atoms:
elementType: O O O N C C C C C C C C C C
charge: -0.197808 -0.206116 -0.177018 0.103349 0.276370 0.344025 -0.164644 -0.047927 -0.037469 -0.105161 0.000765 0.132871 -0.044174 0.122939
polarizability: 2.35506365e+02 1.21467663e+00 1.13074187e+02 -7.86156458e-03 1.17585553e-03 4.66776240e+01
1716.lowfreq: -0.0003 0.0003 0.0007 5.8255 6.6932 8.8120 79.4547 116.4593 182.0353
frequency: 79.4480 116.4569 182.0321 232.0822 268.3067 352.9338 362.6286 393.8047 406.3174 452.4363 480.3578 528.6909 576.9563 586.1598 654.2947 685.6301 701.6220 713.6323 753.0339 758.0759 785.0700 807.0169 830.7691 853.1949 865.9352 894.4576 915.0909 984.7782 986.3887 1029.2004 1076.4201 1117.8529 1156.1670 1199.9576 1230.3853 1283.0677 1288.5408 1369.7031 1376.6180 1404.0171 1456.4211 1508.1588 1534.2082 1612.9482 1616.2348 1695.0930 3133.3732 3151.7065 3188.8381 3223.0900 3267.3169
redmass: 8.8269 5.2047 8.1596 7.9435 5.4725 7.9484 8.3889 8.8861 3.5421 3.8612 6.5868 6.6834 4.0596 9.5317 4.2845 8.8332 8.1388 3.6699 1.8364 6.5361 3.5884 7.7455 1.5462 6.9181 1.3375 7.3178 1.5110 3.4653 1.3193 3.5979 3.1931 1.4469 2.1803 1.5296 1.8967 1.7951 5.1484 2.4546 3.1158 8.5255 4.7304 6.3978 7.9886 7.6080 7.7363 11.0913 1.0909 1.0936 1.0956 1.0938 1.1068
irintensity: 0.0202 2.5477 1.3363 0.2283 0.0238 1.6485 1.3699 10.9196 0.7371 0.0489 0.6613 16.9398 4.6981 3.3637 0.1417 53.5175 3.3277 6.5729 89.3492 4.3431 0.0027 3.0321 24.1021 15.4795 0.1231 60.4229 49.1409 36.7932 0.6042 83.1576 94.0052 102.2507 7.2165 2.3721 21.0752 3.4527 36.8095 81.0817 13.6538 31.5134 17.4238 42.1625 25.5935 19.6501 128.2106 549.7164 9.9886 4.2463 1.6066 3.9321 0.5242
temp: 298.150 k
press: 1.00000 atm
elementType: 8 8 8 7 6 6 6 6 6 6 6 6 6 6 1 1 1 1 1
symmnumber: 1
zpe: 335713.5 jmol-1
zpe.correction: 0.127867 hartree
zpe.thermalcorrener: 0.137510 hartree
zpe.thermalcorrenthalpy: 0.138454 hartree
zpe.thermalcorrgfe: 0.092553 hartree
zpe.sumelectzpe: -663.516613 hartree
zpe.sumelectthermal: -663.506970 hartree
zpe.sumelectthermalent: -663.506026 hartree
zpe.sumelectthermalfe: -663.551926 hartree
dipole: 4.5191 7.2725 -0.0003
dipole: 8.5623
quadrupole: -76.8503 -79.6905 -80.6093
quadrupole: -8.1023 0.0014 0.0013
quadrupole: 2.1997 -0.6404 -1.5593 -8.1023 0.0014 0.0013
hfenergy: -663.6444794 hartree
pointgroup: C01 [X(C10H5N1O3)]
dipole: -1.7664077 -2.8683849 -0.0001332 debye
dipolederiv: -0.9869142 -0.1800363 -0.0000233 0.197512 -0.4768819 0.0000123 -0.0000299 0.0000002 -0.1590789 -1.6106625 -0.1608265 -0.0001135 0.0665103 -0.3100026 0.000048 0.0000329 -0.0000089 -0.2201332 -1.3726583 -0.2901088 0.0000503 -0.6861775 -0.6111062 0.0000432 -0.0003753 -0.0001073 -0.3205378 -0.7084381 -0.0848472 -0.0000152 0.0835735 -0.3072969 -0.0000017 0.0000286 0.0000176 -0.1873107 0.014172 -0.0637877 0.0000002 0.59297 -0.3786055 0.0000255 -0.0000174 0.0000044 0.0633178 -0.6325891 0.0325299 -0.000008 -0.061041 -0.2744789 0.0000034 -0.0000327 0.0000173 0.0374177 0.5847877 -0.0492133 0.0000204 0.0198727 0.213242 -0.0000057 0.0000146 -0.00002 -0.125168 0.7746363 0.1117389 0.0000239 -0.7671925 0.4311512 -0.0000269 0.0000261 0.0000026 0.1174564 1.0786894 0.1320742 0.0000168 0.3378349 0.4043027 0.0000108 -0.0000074 -0.000017 0.1727642 -0.0149659 0.1723492 0.0000006 0.0435061 -0.10443 -0.0000002 0.0000014 0.0000025 -0.2190911 0.7931566 0.0099483 -0.0000006 -0.1746656 0.2421061 -0.0000399 0.0000811 0.0000007 -0.0711036 0.1186384 0.1678926 0.0000009 0.2875656 0.4944591 -0.0000036 0.0000013 -0.0000096 -0.0964195 -0.4461472 -0.1170892 0.0000347 -0.6086751 -0.3105243 -0.0000381 0.0000308 0.0000307 -0.1731712 2.1380472 0.3272179 0.0000462 0.6754084 0.9279904 -0.0000787 0.000257 0.0000202 0.2851424 0.0870973 0.0125731 -0.0000033 -0.010574 -0.0470279 0.0000055 -0.0000047 0.0000112 0.1565862 0.047936 -0.0421689 -0.000003 -0.0926445 0.0322959 0.0000012 0. 0.0000028 0.1997079 0.0842663 -0.0439807 -0.0000048 0.0417287 -0.0769645 0.0000253 0.0000193 0.0000109 0.1418676 0.042851 0.0068942 -0.0000042 0.0221495 0.1016715 0.000003 -0.0000047 0.0000028 0.2163489 0.0080971 0.0588403 -0.0000179 0.0323385 0.0500998 0.0000165 -0.000021 0.0000389 0.1814049 unknown
polarizability: 235.4945722|1.7085246|113.0859792|0.0078662|-0.0011441|46.677624 unknown
InChI: InChI=1S/C10H5NO3/c12-8-2-1-6-5-7-3-4-13-9(7)11-10(6)14-8/h1-5H
charge 0 multiplicity 1
19 atoms
O  -2.882392 1.362062 -0.000101
O  1.818589 1.157416 -0.000014
O  4.131126 1.116329 0.000339
N  -0.48415 1.318137 -0.000027
C  -1.892715 -0.740359 -0.000033
C  0.525933 -0.941076 0.00003
C  -0.751193 -1.565966 0.000018
C  -1.656089 0.676439 -0.000053
C  0.593114 0.501384 0.000012
C  -3.333835 -0.915692 -0.000065
C  1.772866 -1.675154 0.000127
C  -3.881508 0.350011 -0.000102
C  2.988369 -1.031905 0.000146
C  3.09896 0.426655 -0.0001
H  -0.824982 -2.658484 0.000049
H  -3.890662 -1.850618 -0.000058
H  1.737109 -2.771257 0.000242
H  -4.901785 0.724235 -0.000132
H  3.934647 -1.578555 0.000321
