program: Gaussian 09
title: 000192294
version: EM64L-G09RevD.01
frameworkgroup: C1[X(C18H16N2O4)]
method: RPBEPBE
basis: SDD
operation: Freq
keyword: #p
keyword: freq=noraman
keyword: PBEPBE/SDD
title: #p freq=noraman PBEPBE/SDD
converged: YES YES NO NO
title: Mulliken charges:
elementType: O O O O N N C C C C C C C C C C C C C C C C C C H H H H H H H H H H H H H H H H
charge: -0.283617 -0.213861 -0.222545 -0.216038 -0.370042 -0.370652 -0.294924 -0.595806 0.501402 0.188112 0.191288 -0.540981 -0.437803 0.364128 0.181056 -0.200278 -0.392749 -0.408223 0.420670 -0.414624 -0.389747 -0.224425 -0.218556 -0.239788 0.295948 0.259016 0.252688 0.276197 0.255924 0.369472 0.368458 0.230215 0.254859 0.224245 0.225933 0.229626 0.261905 0.227325 0.226904 0.229286
chargesum: 0.00000
title: Mulliken charges with hydrogens summed into heavy atoms:
elementType: O O O O N N C C C C C C C C C C C C C C C C C C
charge: -0.283617 -0.213861 -0.222545 -0.216038 -0.000570 -0.002194 0.001024 -0.084102 0.501402 0.188112 0.191288 -0.264784 -0.181878 0.364128 0.181056 0.029938 -0.137890 0.041955 0.420670 -0.184998 -0.127842 0.002900 0.008349 -0.010503
polarizability: 2.70415388e+02 -3.87369886e+01 1.65315174e+02 5.75588222e+00 1.67555339e+01 2.01229847e+02
1716.lowfreq: -10.7199 -6.8463 -4.1136 0.0003 0.0008 0.0009 2.9037 12.6488 23.3377
frequency: -8.9253 12.5437 23.0899 30.3155 45.3362 67.8943 71.7643 102.1378 132.8258 144.2616 157.3641 188.5213 214.6568 221.1975 243.7305 286.0611 354.8085 357.2487 359.4907 367.6758 401.8439 444.1100 453.5801 457.4871 477.2053 490.6924 517.8373 528.1977 576.0776 588.9637 609.6067 613.6977 621.2727 639.4393 687.4843 698.3787 701.5931 719.8257 743.6145 750.2881 752.0568 788.7451 804.9908 819.1297 845.1105 855.4841 863.0312 881.1549 903.8509 912.4138 926.5900 975.8050 978.7617 979.6566 984.6637 988.9644 989.9836 995.8595 1002.3129 1013.2236 1023.3687 1028.5349 1085.0659 1086.9208 1152.5373 1172.5901 1174.5258 1175.6090 1180.0675 1187.2400 1207.0445 1226.5983 1248.5328 1255.0673 1282.7042 1309.3385 1316.1319 1316.5327 1336.3297 1359.5151 1361.7872 1378.3955 1379.9195 1388.5507 1393.3896 1436.7005 1443.2238 1465.4555 1467.6059 1483.8229 1489.0751 1596.0819 1600.7031 1606.5304 1619.1112 1624.6015 1655.7030 1679.8175 2937.6555 2998.9084 3001.0428 3024.4695 3087.5757 3115.3582 3128.6548 3131.9692 3142.4250 3149.9289 3154.0266 3159.2121 3171.6236 3171.7737 3519.7026 3521.5030
redmass: 3.8250 8.0756 9.2493 7.2108 4.9731 5.4789 7.3765 3.9981 5.6797 6.1903 10.8385 5.7341 3.8172 4.1709 4.8531 3.7281 4.1447 3.7580 6.6986 7.6912 2.8338 5.5925 3.2768 3.4391 8.8910 3.6451 5.0250 6.1469 3.8434 7.2239 6.3752 6.4636 6.1764 3.0570 2.8230 2.5052 2.2175 4.6054 1.6227 1.7383 2.3123 1.7404 1.5525 4.0287 2.7261 1.2516 2.7173 1.8391 1.5015 1.3920 3.3648 4.7043 1.3458 1.4072 3.8586 4.0094 6.0254 1.3494 2.7988 1.7217 3.1872 2.1569 1.5763 1.5862 1.5375 1.0542 1.2625 1.2714 1.4980 1.1151 1.2717 1.8294 2.1151 3.0658 1.8547 1.6693 1.5020 1.5094 1.8219 1.8240 8.3025 1.4652 2.3297 6.9573 3.8429 2.4646 2.3973 1.1658 1.1659 2.2767 2.1307 6.1675 6.6085 6.0003 6.0632 6.7970 8.6754 5.5853 1.0577 1.1029 1.0798 1.0613 1.1044 1.0876 1.0868 1.0871 1.0928 1.0928 1.0912 1.0971 1.0978 1.0983 1.0758 1.0782
irintensity: 0.2862 0.0420 1.1477 0.4289 0.0056 0.3846 2.1821 3.9130 2.3716 0.1376 13.0205 0.9184 2.7978 1.8450 0.2242 1.0821 21.6521 6.0910 16.5939 5.0833 0.6687 8.2537 20.5162 14.6557 12.4214 6.9232 1.6816 0.4367 3.9764 1.3004 1.2324 1.5718 4.6071 2.2056 25.9669 26.0632 28.7576 17.6741 34.4938 23.4054 55.8459 229.9671 33.5936 4.0072 10.7410 0.1165 10.7333 38.1454 0.7406 2.3586 4.7403 35.2110 1.9770 0.5445 1.3072 26.5424 0.0988 0.5870 33.8997 1.7672 24.7712 4.2752 9.6534 6.0745 32.7750 0.6503 1.5137 55.1078 76.8116 0.3575 5.4530 2.9734 53.0066 174.6461 37.1801 93.2684 36.7790 41.2992 131.6353 29.5723 191.3488 6.3129 9.6833 5.4435 33.2133 54.6196 12.8905 36.5969 42.0392 4.1958 32.8555 5.4204 18.3849 154.6594 3.2696 295.3504 114.0891 525.0704 22.4976 26.5833 2.7271 16.6566 2.6296 9.0016 0.7793 5.4980 28.0866 17.2673 1.0873 33.7857 5.3413 12.5140 83.8538 41.0107
temp: 298.150 k
press: 1.00000 atm
elementType: 8 8 8 8 7 7 6 6 6 6 6 6 6 6 6 6 6 6 6 6 6 6 6 6 1 1 1 1 1 1 1 1 1 1 1 1 1 1 1 1
symmnumber: 1
zpe: 807326.6 jmol-1
zpe.correction: 0.307494 hartree
zpe.thermalcorrener: 0.327191 hartree
zpe.thermalcorrenthalpy: 0.328135 hartree
zpe.thermalcorrgfe: 0.256171 hartree
zpe.sumelectzpe: -1104.258277 hartree
zpe.sumelectthermal: -1104.238580 hartree
zpe.sumelectthermalent: -1104.237636 hartree
zpe.sumelectthermalfe: -1104.309600 hartree
dipole: 0.4704 -0.5120 -0.9643
dipole: 1.1888
quadrupole: -134.9685 -143.8641 -139.4959
quadrupole: -2.2215 1.7360 7.0050
quadrupole: 4.4744 -4.4212 -0.0531 -2.2215 1.7360 7.0050
hfenergy: -1104.5657714 hartree
pointgroup: C01[X(C18H16N2O4)]
dipole: -0.1905111 -0.1239322 0.4087787 debye
polarizability: 273.6602176|34.1365302|157.4086474|-1.5414273|-9.5347428|205.8915438 unknown
InChI: InChI=1S/C18H16N2O4/c21-16-15(17(22)20-18(23)19-16)10-13-7-4-8-14(9-13)24-11-12-5-2-1-3-6-12/h1-9,15,19-20H,10-11H2
charge 0 multiplicity 1
40 atoms
O  -1.912938 1.157175 -0.44195
O  5.235838 0.524443 0.214951
O  1.449949 -1.892764 2.089088
O  3.040544 -2.800088 -2.186058
N  4.111785 -1.130357 -0.949353
N  2.274551 -2.312397 -0.032167
C  3.32586 -0.508299 1.34328
C  2.632898 0.859267 1.707867
C  1.696409 1.377232 0.624683
C  4.302777 -0.317901 0.181212
C  2.279947 -1.612497 1.185447
C  0.326531 1.002768 0.642261
C  2.178862 2.219078 -0.406612
C  -0.546386 1.465817 -0.371934
C  3.132108 -2.123787 -1.133955
C  1.29561 2.677994 -1.414106
C  -0.061558 2.306533 -1.405311
C  -2.468155 0.280421 0.603166
C  -3.927714 0.012147 0.291252
C  -4.815255 -0.304531 1.3495
C  -4.412291 0.023916 -1.039131
C  -6.166136 -0.619756 1.08212
C  -5.765669 -0.282883 -1.305319
C  -6.645916 -0.610159 -0.248024
H  3.940853 -0.782561 2.224007
H  3.446199 1.580602 1.899137
H  2.08579 0.693227 2.652096
H  -0.035387 0.364294 1.454535
H  3.231857 2.522351 -0.41423
H  4.751215 -0.989274 -1.738545
H  1.563679 -3.042314 -0.148304
H  1.667858 3.335595 -2.207192
H  -0.759622 2.657035 -2.171455
H  -2.361682 0.763483 1.595933
H  -1.890888 -0.669489 0.618467
H  -4.453067 -0.304392 2.385516
H  -3.729672 0.288571 -1.851989
H  -6.842713 -0.86341 1.908821
H  -6.13309 -0.266021 -2.337605
H  -7.694579 -0.849371 -0.456897
