program: Gaussian 09
title: 000192288
version: EM64L-G09RevD.01
frameworkgroup: C1[X(C17H14ClN5O2)]
method: RPBEPBE
basis: SDD
operation: Freq
keyword: #p
keyword: freq=noraman
keyword: PBEPBE/SDD
title: #p freq=noraman PBEPBE/SDD
converged: YES YES NO NO
title: Mulliken charges:
elementType: Cl O O N N N N N C C C C C C C C C C C C C C C C C H H H H H H H H H H H H H H
charge: -0.001499 -0.260851 -0.239778 -0.084317 -0.284448 -0.056232 -0.104305 -0.033114 -0.313401 -0.472411 -0.472037 0.133521 0.344473 0.149068 -0.152922 -0.565735 0.365467 0.239604 -0.258315 0.148948 -0.373849 -0.618570 -0.291367 -0.215711 -0.248851 0.272006 0.246755 0.255789 0.256377 0.246095 0.296157 0.275017 0.283032 0.264420 0.235814 0.244164 0.278300 0.245620 0.267087
chargesum: 0.00000
title: Mulliken charges with hydrogens summed into heavy atoms:
elementType: Cl O O N N N N N C C C C C C C C C C C C C C C C C
charge: -0.001499 -0.260851 -0.239778 -0.084317 -0.284448 -0.056232 -0.104305 -0.033114 -0.041395 0.030132 0.030435 0.133521 0.344473 0.149068 -0.152922 0.005439 0.365467 0.239604 0.024717 0.148948 -0.109430 0.139708 -0.291367 0.029909 0.018236
polarizability: 3.88920529e+02 1.35576623e+01 2.25354252e+02 -7.68289087e+00 4.49906070e+00 1.34596375e+02
1716.lowfreq: -2.6269 -0.0012 -0.0010 -0.0008 0.9949 4.7733 16.8980 25.4570 37.7580
frequency: 16.8233 25.4417 37.7302 44.1650 62.9226 85.0361 91.0027 113.2954 130.7670 147.2365 166.3301 185.2407 191.5758 194.1424 205.8522 236.2933 280.1973 308.7219 318.6477 341.4090 365.2667 382.8606 396.6434 407.0680 423.7437 437.4216 447.9497 474.6273 539.1368 558.5284 594.1094 628.3748 636.7134 650.1278 658.5904 684.0420 697.5864 721.2737 732.1694 760.6996 762.9724 767.5966 788.1379 796.6263 801.1999 805.2999 816.2254 875.3132 887.6457 893.6694 895.9101 903.6298 913.2814 954.7939 978.1178 986.7692 1017.9604 1040.7382 1047.3596 1066.6388 1075.1080 1077.1870 1083.9643 1102.3243 1118.0598 1125.4219 1153.7750 1176.0953 1183.1565 1194.8701 1203.2236 1208.7324 1215.5866 1234.4573 1253.4702 1260.4874 1318.8047 1325.7781 1358.6945 1377.6162 1384.6280 1388.2849 1422.4142 1424.0895 1435.9957 1445.2016 1450.6724 1459.9392 1465.5035 1473.1789 1479.7749 1484.3451 1493.1967 1565.3572 1586.4186 1600.6818 1627.7734 2984.1868 3001.3696 3068.4428 3102.6183 3110.1810 3118.8449 3123.7754 3150.8955 3166.8422 3168.5273 3183.0167 3206.3843 3225.3255 3244.4642
redmass: 3.4755 4.4596 7.6378 7.1814 6.6694 6.1811 4.2669 4.5614 1.0810 5.5002 5.5596 6.2418 5.5352 5.7588 4.4878 5.9995 6.3140 5.1630 4.5517 5.9068 4.5472 4.2637 5.3665 7.8473 7.0263 4.3160 5.1522 6.2154 4.6549 4.7456 5.3330 3.1142 8.2591 4.7715 5.0201 5.5765 6.8226 6.3969 7.7640 6.0179 2.7681 4.5944 1.1037 1.9801 2.3297 1.6697 9.2505 4.7569 11.0800 1.8422 4.1758 1.3873 3.7383 4.0149 1.3516 3.6481 8.3200 3.0328 1.2325 2.3566 1.7620 1.2258 2.1817 1.1582 1.6976 2.0254 1.7832 1.3977 1.8008 2.8709 1.9160 2.7397 2.4939 3.4970 2.0425 2.2437 4.9211 1.3944 8.8171 4.2780 2.3801 2.1717 1.6298 2.0365 1.0861 3.1623 3.7190 1.3063 1.1188 7.3137 1.2264 1.0479 6.3637 7.0329 7.6759 7.6270 11.2649 1.0350 1.0686 1.1017 1.0505 1.0619 1.0954 1.0990 1.0874 1.0934 1.0914 1.0992 1.1185 1.1155 1.0989
irintensity: 0.3139 0.4534 1.6670 0.0896 2.5824 1.8619 1.6534 0.2324 0.0849 3.5285 1.2976 0.3219 2.1522 1.5417 2.1335 0.7583 3.0996 0.4480 2.5294 3.8324 3.5285 12.6980 2.2948 2.4384 3.7117 10.4391 0.6154 1.8458 0.0887 2.6655 1.6622 8.1713 2.3329 10.0419 5.5040 18.5185 2.4342 11.2421 6.2414 39.6153 23.0536 26.2394 0.3626 50.9559 9.6602 8.1991 9.1475 18.9887 12.3214 1.8199 0.9550 0.3719 23.3149 34.0642 0.9177 29.8297 46.9463 21.8990 21.8037 22.6148 19.0782 12.5754 16.4502 1.0971 2.9379 6.8711 20.5740 1.3435 29.0554 11.6815 27.2884 150.1192 30.3937 3.9032 12.0782 20.8166 29.2426 22.3977 2.7206 8.1515 9.0516 65.4379 36.7068 25.2427 10.8379 6.7198 310.0875 3.1646 29.4493 248.1042 5.7279 9.5593 4.5129 23.8726 173.7037 232.5096 168.6790 33.7320 14.7388 22.2191 15.3815 9.9471 1.1950 0.5820 4.7214 3.1920 1.2302 5.2705 0.3746 21.2336 0.6746
temp: 298.150 k
press: 1.00000 atm
elementType: 17 8 8 7 7 7 7 7 6 6 6 6 6 6 6 6 6 6 6 6 6 6 6 6 6 1 1 1 1 1 1 1 1 1 1 1 1 1 1
symmnumber: 1
zpe: 750470.0 jmol-1
zpe.correction: 0.285839 hartree
zpe.thermalcorrener: 0.307129 hartree
zpe.thermalcorrenthalpy: 0.308073 hartree
zpe.thermalcorrgfe: 0.233179 hartree
zpe.sumelectzpe: -1538.644027 hartree
zpe.sumelectthermal: -1538.622737 hartree
zpe.sumelectthermalent: -1538.621793 hartree
zpe.sumelectthermalfe: -1538.696687 hartree
dipole: 0.7275 2.2179 -2.9645
dipole: 3.7731
quadrupole: -136.4227 -148.2872 -156.2725
quadrupole: 22.5894 -9.3392 -1.0535
quadrupole: 10.5715 -1.2931 -9.2784 22.5894 -9.3392 -1.0535
hfenergy: -1538.929866 hartree
pointgroup: C01 [X(C17H14Cl1N5O2)]
dipole: -0.2829308 0.6984606 1.2789407 debye
polarizability: 389.014693|-5.5857223|224.2106634|-16.0310095|7.3155624|135.6457992 unknown
InChI: InChI=1S/C17H14ClN5O2/c1-22-7-12-14(16-20-15(21-25-16)9-5-6-9)19-8-23(12)11-4-2-3-10(18)13(11)17(22)24/h2-4,8-9H,5-7H2,1H3
charge 0 multiplicity 1
39 atoms
Cl -5.350858 -2.042111 0.314034
O  2.539926 -0.793551 0.36161
O  -3.065504 -1.931017 -1.798268
N  3.516685 1.137003 -0.370444
N  -1.222648 1.24223 -0.166557
N  3.999209 -1.020188 0.382547
N  -1.24119 -1.791165 -0.348333
N  0.702884 2.294116 -0.754333
C  5.93155 0.43244 -0.22529
C  6.885862 -0.688255 -0.705694
C  6.958811 -0.207338 0.738818
C  4.49025 0.16404 -0.064405
C  -0.18245 0.351271 0.149638
C  2.358367 0.534914 -0.105528
C  0.998739 1.018847 -0.221088
C  -0.523289 -1.008339 0.690101
C  -2.610613 1.023362 0.127474
C  -3.190704 -0.27223 -0.041189
C  -0.629093 2.397249 -0.705322
C  -2.494046 -1.398845 -0.799218
C  -3.36626 2.116075 0.614888
C  -0.485647 -2.821156 -1.086845
C  -4.542771 -0.417318 0.365935
C  -4.719014 1.934935 0.956653
C  -5.309615 0.656512 0.85528
H  6.129476 1.447731 -0.575492
H  7.680036 -0.39913 -1.399149
H  6.433137 -1.665146 -0.895484
H  6.555501 -0.863399 1.514901
H  7.804479 0.413768 1.045932
H  0.396686 -1.544145 0.962506
H  -1.154699 -0.924346 1.595042
H  -1.209729 3.239169 -1.072613
H  -2.884043 3.088055 0.755014
H  -0.177254 -3.631156 -0.402316
H  0.416898 -2.386703 -1.555617
H  -1.141687 -3.229239 -1.870494
H  -5.307696 2.777133 1.332669
H  -6.346987 0.490424 1.157136
