program: Gaussian 09
title: 000192280
version: EM64L-G09RevD.01
frameworkgroup: C1[X(C15H13N3O)]
method: RPBEPBE
basis: SDD
operation: Freq
keyword: #p
keyword: freq=noraman
keyword: PBEPBE/SDD
title: #p freq=noraman PBEPBE/SDD
converged: YES YES NO NO
title: Mulliken charges:
elementType: O N N N C C C C C C C C C C C C C C C H H H H H H H H H H H H H
charge: -0.272249 -0.215385 -0.022553 0.001377 0.233646 0.148781 -0.066708 0.139969 -0.314761 0.347252 -0.364453 -0.360387 -0.239958 -0.226853 -0.667111 -0.304410 -0.501286 -0.186762 -0.344429 0.232892 0.246531 0.268715 0.279390 0.237104 0.239517 0.247856 0.221754 0.221165 0.264315 0.277555 0.233368 0.246120
chargesum: 0.00000
title: Mulliken charges with hydrogens summed into heavy atoms:
elementType: O N N N C C C C C C C C C C C C C C C
charge: -0.272249 -0.215385 -0.022553 0.001377 0.233646 0.148781 -0.066708 0.139969 0.164661 0.347252 -0.095738 -0.080998 -0.002854 0.012663 0.023664 -0.040095 -0.223731 0.046606 -0.098309
polarizability: 2.63598468e+02 2.52211266e+00 2.20672098e+02 -6.75954186e+00 -2.98803387e+00 9.61792266e+01
1716.lowfreq: -6.4587 -3.9668 -0.0004 -0.0001 0.0002 3.2790 32.5977 48.8253 61.0274
frequency: 32.3778 48.7910 61.0214 73.6819 85.3483 132.2449 178.8776 209.1672 222.6669 237.2427 263.5780 301.5989 329.5866 359.8857 395.8761 407.7511 427.5273 443.7937 478.5018 490.8668 529.9681 595.7107 610.7969 628.6841 657.5786 671.6915 684.8247 717.5647 722.3151 758.2393 787.7593 792.7664 796.9679 824.2549 881.1128 900.7712 930.2098 945.4053 954.0562 986.1786 988.9068 997.1834 1004.7306 1011.2238 1028.7906 1036.8254 1049.2527 1088.4421 1103.6267 1113.6040 1161.0324 1179.2678 1198.3466 1201.5866 1217.7004 1274.9004 1280.9878 1307.1171 1327.1799 1334.8709 1354.4949 1355.0307 1386.3692 1395.6593 1402.1475 1424.4990 1449.4077 1460.9247 1470.6471 1478.1985 1483.1886 1493.1925 1545.3076 1563.5947 1583.4840 1600.7577 1615.4968 2992.2134 3041.2981 3088.9602 3094.4380 3119.0664 3129.8814 3135.3202 3137.2877 3152.2815 3153.1541 3166.7011 3172.9974 3175.2993
redmass: 2.6586 4.2774 6.1249 4.4075 4.8066 5.2650 4.1271 1.5405 4.1630 2.6942 3.6260 5.9504 3.0845 4.6924 3.0786 5.5962 3.6735 4.9493 7.3350 4.4864 4.3062 8.2020 7.1214 4.8842 4.5788 5.9084 4.4454 6.6229 1.9723 3.1416 1.6070 2.1186 1.9609 1.8516 3.6328 1.4835 1.3169 1.8498 3.3578 1.4002 1.4084 2.9420 3.7762 1.3416 3.3111 2.1464 2.3456 2.1239 2.1332 1.6527 2.2908 1.1660 2.0884 1.4183 2.1057 5.3818 1.6923 9.8644 1.3743 1.3259 1.3677 2.7654 1.2204 3.5486 3.1724 2.5590 1.1349 2.2739 1.0446 3.2804 1.0601 4.3968 5.4493 7.4460 6.0016 9.4753 6.5151 1.0352 1.0595 1.1002 1.1002 1.1058 1.0901 1.0895 1.0866 1.0902 1.0919 1.0948 1.1001 1.0995
irintensity: 0.1671 0.8547 4.2427 1.4777 2.0966 0.6676 0.5252 0.4633 0.6080 0.4720 0.8912 5.4157 4.8756 6.6792 3.0169 4.5580 1.1976 5.8126 2.6228 2.2925 0.6157 6.1503 9.1393 0.5461 15.3740 4.1726 28.0939 11.9286 37.5057 3.3366 28.6292 22.5535 12.2633 34.5554 11.6670 0.4352 2.4255 9.1486 11.3798 0.7371 2.0549 7.4340 21.3224 0.4787 8.7890 8.7364 46.0571 11.9272 15.0190 11.6563 5.8192 4.3805 4.9281 1.0588 26.9925 69.7620 0.3870 1.1501 36.7023 14.2183 0.6177 4.8400 21.4553 56.5946 5.9507 8.3261 27.0716 21.3306 15.7465 15.2495 10.0430 1.9250 4.8058 74.3630 0.8178 249.5335 8.1658 26.1499 17.1004 28.2213 23.0172 12.1735 25.5548 3.5417 4.0362 7.2211 19.8368 6.9784 18.7331 17.0813
temp: 298.150 k
press: 1.00000 atm
elementType: 8 7 7 7 6 6 6 6 6 6 6 6 6 6 6 6 6 6 6 1 1 1 1 1 1 1 1 1 1 1 1 1
symmnumber: 1
zpe: 652467.9 jmol-1
zpe.correction: 0.248512 hartree
zpe.thermalcorrener: 0.264021 hartree
zpe.thermalcorrenthalpy: 0.264965 hartree
zpe.thermalcorrgfe: 0.204622 hartree
zpe.sumelectzpe: -817.552230 hartree
zpe.sumelectthermal: -817.536721 hartree
zpe.sumelectthermalent: -817.535777 hartree
zpe.sumelectthermalfe: -817.596120 hartree
dipole: -1.0375 -0.2609 2.0663
dipole: 2.3268
quadrupole: -121.9426 -92.2509 -112.8121
quadrupole: 8.1458 -5.2114 0.3236
quadrupole: -12.9408 16.7510 -3.8102 8.1458 -5.2114 0.3236
hfenergy: -817.8007418 hartree
pointgroup: C01 [X(C15H13N3O1)]
dipole: -0.3921675 0.0275173 0.8267195 debye
polarizability: 263.2634645|-1.6462189|217.9044827|-11.2225267|-18.0072456|99.2818448 unknown
InChI: InChI=1S/C15H13N3O/c1-2-18-15(19)13-8-4-3-7-12(13)14(17-18)11-6-5-9-16-10-11/h3-10H,2H2,1H3
charge 0 multiplicity 1
32 atoms
O  3.681309 -0.779999 -0.437363
N  1.497673 -1.585785 -0.197002
N  0.129956 -1.443138 -0.077101
N  -4.030681 0.725954 -0.751167
C  0.437448 0.995544 -0.07414
C  1.851678 0.821759 -0.233863
C  -0.39606 -0.208023 -0.040435
C  2.442368 -0.530604 -0.307108
C  1.977849 -2.99079 -0.195602
C  -1.883609 -0.182925 0.033912
C  -0.0681 2.320365 0.091276
C  2.717063 1.94446 -0.279955
C  0.799269 3.423981 0.051058
C  2.195138 3.241212 -0.150012
C  2.3440 -3.469703 1.222267
C  -2.57961 -1.098465 0.866816
C  -2.66739 0.693042 -0.768748
C  -3.988588 -1.08199 0.891103
C  -4.673273 -0.147186 0.079772
H  1.166447 -3.599023 -0.625648
H  2.863061 -3.031484 -0.851236
H  -1.134991 2.477043 0.271107
H  3.788593 1.760188 -0.406606
H  0.39637 4.434134 0.181798
H  2.86074 4.109899 -0.186617
H  3.162344 -2.858872 1.639744
H  1.471084 -3.409841 1.896035
H  2.683376 -4.520518 1.186635
H  -2.009097 -1.806518 1.475446
H  -2.190664 1.377597 -1.479587
H  -4.549993 -1.773385 1.527169
H  -5.767507 -0.089628 0.08055
