program: Gaussian 09
title: 000192243
version: EM64L-G09RevD.01
frameworkgroup: C1[X(C12H16O7)]
method: RPBEPBE
basis: SDD
operation: Freq
keyword: #pfreq=noraman
keyword: PBEPBE/SDD
title: #p freq=noraman PBEPBE/SDD
converged: YES YES NO NO
title: Mulliken charges:
elementType: O O O O O O O C C C C C C C C C C C C H H H H H H H H H H H H H H H H
charge: -0.347741 -0.286238 -0.460090 -0.438399 -0.439168 -0.430392 -0.434084 0.233454 -0.208795 -0.123970 -0.055743 -0.423595 -0.362201 0.324587 -0.377135 -0.295210 -0.318605 -0.367867 0.276460 0.267036 0.245927 0.284288 0.253922 0.260868 0.198402 0.230433 0.372264 0.344364 0.365532 0.341677 0.255735 0.283171 0.255957 0.220992 0.354164
chargesum: 0.00000
title: Mulliken charges with hydrogens summed into heavy atoms:
elementType: O O O O O O O C C C C C C C C C C C C
charge: -0.347741 -0.286238 -0.087825 -0.094035 -0.073636 -0.088716 -0.079920 0.233454 0.058241 0.121957 0.228545 0.091195 0.066634 0.324587 -0.121400 -0.012038 -0.062648 -0.146875 0.276460
polarizability: 1.98561803e+02 5.15935638e+00 1.45291818e+02 2.44285487e-01 1.38480604e+01 1.11491192e+02
1716.lowfreq: -7.2973 -0.0008 -0.0006 -0.0001 6.3177 11.6703 16.7842 23.1796 35.4121
frequency: 16.0596 22.9317 35.2547 59.1029 77.2980 103.8876 130.7003 149.5563 162.9213 183.5310 231.9113 235.8463 241.6372 295.2524 303.6542 312.0071 333.3620 340.1869 358.4349 376.7188 397.3065 406.9271 415.6185 434.5291 444.2680 479.8464 497.7903 521.3874 531.9941 611.5852 617.3268 650.7851 677.6579 706.7770 712.6203 739.7824 762.8174 805.3262 820.4467 833.5610 837.4888 892.8528 933.2679 942.2232 954.1447 955.8192 966.6338 987.0433 991.8057 999.7909 1015.1694 1025.8495 1052.4587 1070.6324 1092.5210 1095.4129 1141.7638 1146.2230 1162.0578 1172.7010 1183.5953 1202.1289 1211.8628 1235.5498 1249.7192 1257.8560 1281.8508 1290.3615 1294.8249 1299.9649 1324.6426 1335.4392 1362.2324 1380.3474 1386.4812 1395.7275 1424.7460 1427.8075 1459.1537 1462.1744 1489.6878 1599.8168 1622.3883 2959.4705 2993.6262 3026.1076 3044.0136 3054.7474 3084.6107 3118.7990 3119.1121 3158.0452 3179.3814 3186.5052 3270.5829 3538.1357 3555.0418 3570.0216 3586.1428
redmass: 5.9710 4.1578 6.2126 7.0758 6.2492 3.6773 6.5325 3.4605 3.6883 4.4947 4.0050 4.1829 3.4846 4.6389 1.3056 4.5222 5.0734 1.1315 4.9657 3.4061 1.8330 1.9397 2.9097 4.5453 1.4786 5.0880 3.7690 3.6959 4.2965 6.0591 3.6740 5.7367 4.7836 1.1726 4.1690 5.8473 4.0139 1.3021 5.9905 1.7532 3.0084 2.6452 1.8140 1.8528 4.4452 1.4195 5.9669 3.2875 3.3352 2.7284 3.8363 4.1167 3.2534 2.0454 1.7552 1.5847 1.3629 1.6390 1.4326 1.1590 1.7142 1.2801 1.4409 2.2850 3.1226 1.3688 1.2528 1.2869 1.3413 1.3374 1.3316 1.1950 1.2195 1.2925 5.8811 1.5279 1.2063 3.1528 1.0886 1.0861 2.6377 7.0252 6.4684 1.0686 1.0856 1.0635 1.0866 1.0860 1.0955 1.1019 1.0910 1.0885 1.0970 1.0940 1.0686 1.0648 1.0657 1.0662 1.0661
irintensity: 2.4215 0.9253 0.2372 4.6792 2.7345 1.0257 1.0362 17.2744 2.0783 3.6187 9.6796 2.1588 8.1205 19.8890 159.9280 4.9943 2.3110 140.2726 13.9458 24.7923 109.9551 104.2592 6.4333 11.9835 74.7127 1.8561 26.1175 6.2249 2.6057 3.3713 0.9321 1.9658 4.7181 151.3689 1.7255 41.0510 50.0111 19.1151 8.4423 53.5218 138.7119 112.8563 40.0937 28.5861 72.0615 6.4897 150.3285 55.5980 150.2297 29.9410 78.8174 36.5264 12.9120 20.5108 1.8157 82.6618 219.4058 56.0126 35.7030 28.9036 147.5792 28.5964 4.6903 53.0700 5.8322 7.4323 4.7797 0.8728 10.6836 5.4624 60.5029 10.0056 6.0346 16.6442 8.3138 17.1258 81.1824 31.1696 9.6649 9.4871 246.0333 1.9792 2.8601 43.6378 36.5035 25.8471 25.3483 9.4419 22.5595 7.7675 14.4250 4.8368 4.7169 0.5815 234.5745 14.4886 4.7881 8.0905 41.9886
temp: 298.150 k
press: 1.00000 atm
elementType: 8 8 8 8 8 8 8 6 6 6 6 6 6 6 6 6 6 6 6 1 1 1 1 1 1 1 1 1 1 1 1 1 1 1 1
symmnumber: 1
zpe: 712359.3 jmol-1
zpe.correction: 0.271323 hartree
zpe.thermalcorrener: 0.290336 hartree
zpe.thermalcorrenthalpy: 0.291280 hartree
zpe.thermalcorrgfe: 0.222543 hartree
zpe.sumelectzpe: -991.926047 hartree
zpe.sumelectthermal: -991.907034 hartree
zpe.sumelectthermalent: -991.906090 hartree
zpe.sumelectthermalfe: -991.974827 hartree
dipole: 1.0903 0.2609 1.0318
dipole: 1.5237
quadrupole: -115.5165 -112.6983 -113.6173
quadrupole: 9.2676 8.5783 11.0347
quadrupole: -1.5725 1.2457 0.3267 9.2676 8.5783 11.0347
hfenergy: -992.19737 hartree
pointgroup: C01[X(C12H16O7)]
dipole: 0.4209256 0.0877719 -0.4176964 debye
polarizability: 198.8245267|1.7218961|131.6344656|-4.3749871|21.2623928|124.8858209 unknown
InChI: InChI=1S/C12H16O7/c13-5-9-10(16)11(17)12(6-14,19-9)18-8-3-1-7(15)2-4-8/h1-4,9-11,13-17H,5-6H2
charge 0 multiplicity 1
35 atoms
O  -1.276556 -0.646445 -0.591019
O  0.087249 0.754402 0.89518
O  -3.369051 1.624457 0.068264
O  -2.251078 -0.750986 2.668845
O  -1.902674 1.488902 -2.220555
O  -2.501146 -3.124224 -1.407735
O  5.501076 -0.2516 -0.344935
C  -1.033013 0.695457 -0.041376
C  -2.288038 1.001947 0.82294
C  -2.753564 -0.396153 1.340401
C  -2.14456 -1.425606 0.362591
C  -0.79522 1.624147 -1.25291
C  -3.157666 -2.188204 -0.490855
C  1.417022 0.456726 0.475123
C  2.430605 1.229535 1.0893
C  1.75592 -0.58539 -0.418294
C  3.785007 0.973713 0.805846
C  3.1161 -0.832153 -0.712662
C  4.128656 -0.055465 -0.101985
H  -2.012408 1.667894 1.659114
H  -3.862309 -0.392581 1.316536
H  -1.491752 -2.118256 0.922139
H  0.17367 1.395157 -1.731656
H  -0.80728 2.675748 -0.929497
H  -3.800858 -1.467299 -1.040729
H  -3.79399 -2.813522 0.157369
H  -3.129784 1.660699 -0.908207
H  -2.610307 -0.114118 3.336807
H  -1.92299 0.538245 -2.507483
H  -1.819352 -2.619086 -1.92056
H  2.143725 2.020363 1.788841
H  0.970456 -1.200772 -0.862171
H  4.582769 1.558195 1.2727
H  3.378792 -1.641201 -1.406649
H  5.645048 -0.999823 -0.97552
